[Trac] [Failed Build] AllemaniACs [1149] FawkesNao

AllemaniACs trac-notifications at lists.kbsg.rwth-aachen.de
Thu Jul 3 15:37:55 CEST 2008


  Failed build of AllemaniACs [1149]
---------------------------------------------------------------------

  Changeset:             1149  -  <https://lechuck.informatik.rwth-aachen.de:2342/trac/changeset/1149>
  Committed by:          tim

  Build Configuration:   FawkesNao
  Build Slave:           sparrow
  Build Number:          772  -  <https://lechuck.informatik.rwth-aachen.de:2342/trac/build/FawkesNao/772>

  Failed Steps:          build: make failed (512), build: make failed (512)
  Failure Log:           
  
 info: make: Entering directory `'
 info: --- Linking bin/webots_cam_size -&gt; etc/scripts/webots_cam_size
 info: --&gt; Entering sub-directory src ---
 info:    --&gt; Entering sub-directory libs ---
 info:       --&gt; Entering sub-directory core ---
 info:          --- Compiling exception.cpp (C++)
error: src/libs/core/exception.cpp:26:28: Fehler: core/exception.h: Datei oder Verzeichnis nicht gefunden
error: src/libs/core/exception.cpp:27:34: Fehler: core/threading/mutex.h: Datei oder Verzeichnis nicht gefunden
error: src/libs/core/exception.cpp:145: Fehler: »Exception« wurde nicht deklariert
error: src/libs/core/exception.cpp:145: Fehler: ISO-C++ verbietet Deklaration von »Exception« ohne Typ
error: src/libs/core/exception.cpp: In function »int fawkes::Exception(const char*, ...)«:
error: src/libs/core/exception.cpp:147: Fehler: »messages_mutex« wurde in diesem Gültigkeitsbereich nicht definiert
error: src/libs/core/exception.cpp:147: Fehler: expected type-specifier before »Mutex«
error: src/libs/core/exception.cpp:147: Fehler: expected `;' before »Mutex«
error: src/libs/core/exception.cpp:149: Fehler: »_errno« wurde in diesem Gültigkeitsbereich nicht definiert
error: src/libs/core/exception.cpp:151: Fehler: »messages« wurde in diesem Gültigkeitsbereich nicht definiert
error: src/libs/core/exception.cpp:152: Fehler: »messages_end« wurde in diesem Gültigkeitsbereich nicht definiert
 info: make: Leaving directory `'
error: src/libs/core/exception.cpp:153: Fehler: »messages_iterator« wurde in diesem Gültigkeitsbereich nicht definiert
error: src/libs/core/exception.cpp:157: Fehler: »va_start« wurde in diesem Gültigkeitsbereich nicht definiert
error: src/libs/core/exception.cpp:158: Fehler: »append_nolock_va« wurde in diesem Gültigkeitsbereich nicht definiert
error: src/libs/core/exception.cpp:159: Fehler: »va_end« wurde in diesem Gültigkeitsbereich nicht definiert
error: src/libs/core/exception.cpp:161: Fehler: »append_nolock« wurde in diesem Gültigkeitsbereich nicht definiert
error: src/libs/core/exception.cpp: At global scope:
error: src/libs/core/exception.cpp:174: Fehler: »Exception« is not a class or namespace
error: src/libs/core/exception.cpp:174: Fehler: ISO-C++ verbietet Deklaration von »Exception« ohne Typ
error: src/libs/core/exception.cpp: In function »int fawkes::Exception(const char*, char*)«:
error: src/libs/core/exception.cpp:176: Fehler: »messages_mutex« wurde in diesem Gültigkeitsbereich nicht definiert
error: src/libs/core/exception.cpp:176: Fehler: expected type-specifier before »Mutex«
error: src/libs/core/exception.cpp:176: Fehler: expected `;' before »Mutex«
error: src/libs/core/exception.cpp:178: Fehler: »_errno« wurde in diesem Gültigkeitsbereich nicht definiert
error: src/libs/core/exception.cpp:180: Fehler: »messages« wurde in diesem Gültigkeitsbereich nicht definiert
error: src/libs/core/exception.cpp:181: Fehler: »messages_end« wurde in diesem Gültigkeitsbereich nicht definiert
error: src/libs/core/exception.cpp:182: Fehler: »messages_iterator« wurde in diesem Gültigkeitsbereich nicht definiert
error: src/libs/core/exception.cpp:185: Fehler: »append_nolock_va« wurde in diesem Gültigkeitsbereich nicht definiert
error: src/libs/core/exception.cpp:187: Fehler: »append_nolock« wurde in diesem Gültigkeitsbereich nicht definiert
error: src/libs/core/exception.cpp: At global scope:
error: src/libs/core/exception.cpp:200: Fehler: »Exception« is not a class or namespace
error: src/libs/core/exception.cpp:200: Fehler: ISO-C++ verbietet Deklaration von »Exception« ohne Typ
error: src/libs/core/exception.cpp: In function »int fawkes::Exception(int, const char*, ...)«:
error: src/libs/core/exception.cpp:202: Fehler: »messages_mutex« wurde in diesem Gültigkeitsbereich nicht definiert
error: src/libs/core/exception.cpp:202: Fehler: expected type-specifier before »Mutex«
error: src/libs/core/exception.cpp:202: Fehler: expected `;' before »Mutex«
error: src/libs/core/exception.cpp:204: Fehler: »_errno« wurde in diesem Gültigkeitsbereich nicht definiert
error: src/libs/core/exception.cpp:206: Fehler: »messages« wurde in diesem Gültigkeitsbereich nicht definiert
error: src/libs/core/exception.cpp:207: Fehler: »messages_end« wurde in diesem Gültigkeitsbereich nicht definiert
error: src/libs/core/exception.cpp:208: Fehler: »messages_iterator« wurde in diesem Gültigkeitsbereich nicht definiert
error: src/libs/core/exception.cpp:212: Fehler: »va_start« wurde in diesem Gültigkeitsbereich nicht definiert
error: src/libs/core/exception.cpp:215: Fehler: »append_nolock_va« wurde in diesem Gültigkeitsbereich nicht definiert
error: src/libs/core/exception.cpp:217: Fehler: »append_nolock_va« wurde in diesem Gültigkeitsbereich nicht definiert
error: src/libs/core/exception.cpp:220: Fehler: »va_end« wurde in diesem Gültigkeitsbereich nicht definiert
error: src/libs/core/exception.cpp:222: Fehler: »append_nolock« wurde in diesem Gültigkeitsbereich nicht definiert
error: src/libs/core/exception.cpp: At global scope:
error: src/libs/core/exception.cpp:261: Fehler: »Exception« is not a class or namespace
error: src/libs/core/exception.cpp:261: Fehler: expected »,« or »...« before »&amp;« token
error: src/libs/core/exception.cpp:261: Fehler: ISO-C++ verbietet Deklaration von »Exception« ohne Typ
error: src/libs/core/exception.cpp:261: Fehler: ISO-C++ verbietet Deklaration von »Exception« ohne Typ
error: src/libs/core/exception.cpp: In function »int fawkes::Exception(int)«:
error: src/libs/core/exception.cpp:263: Fehler: »messages_mutex« wurde in diesem Gültigkeitsbereich nicht definiert
error: src/libs/core/exception.cpp:263: Fehler: expected type-specifier before »Mutex«
error: src/libs/core/exception.cpp:263: Fehler: expected `;' before »Mutex«
error: src/libs/core/exception.cpp:265: Fehler: »messages« wurde in diesem Gültigkeitsbereich nicht definiert
error: src/libs/core/exception.cpp:266: Fehler: »messages_end« wurde in diesem Gültigkeitsbereich nicht definiert
error: src/libs/core/exception.cpp:267: Fehler: »messages_iterator« wurde in diesem Gültigkeitsbereich nicht definiert
error: src/libs/core/exception.cpp:269: Fehler: »_errno« wurde in diesem Gültigkeitsbereich nicht definiert
error: src/libs/core/exception.cpp:269: Fehler: »exc« wurde in diesem Gültigkeitsbereich nicht definiert
error: src/libs/core/exception.cpp:270: Fehler: »copy_messages« wurde in diesem Gültigkeitsbereich nicht definiert
error: src/libs/core/exception.cpp: At global scope:
error: src/libs/core/exception.cpp:279: Fehler: »Exception« is not a class or namespace
error: src/libs/core/exception.cpp:279: Fehler: ISO-C++ verbietet Deklaration von »Exception« ohne Typ
error: src/libs/core/exception.cpp: In function »int fawkes::Exception()«:
error: src/libs/core/exception.cpp:281: Fehler: »messages_mutex« wurde in diesem Gültigkeitsbereich nicht definiert
error: src/libs/core/exception.cpp:281: Fehler: expected type-specifier before »Mutex«
error: src/libs/core/exception.cpp:281: Fehler: expected `;' before »Mutex«
error: src/libs/core/exception.cpp:282: Fehler: »_errno« wurde in diesem Gültigkeitsbereich nicht definiert
error: src/libs/core/exception.cpp:283: Fehler: »messages« wurde in diesem Gültigkeitsbereich nicht definiert
error: src/libs/core/exception.cpp:284: Fehler: »messages_end« wurde in diesem Gültigkeitsbereich nicht definiert
error: src/libs/core/exception.cpp:285: Fehler: »messages_iterator« wurde in diesem Gültigkeitsbereich nicht definiert
error: src/libs/core/exception.cpp: At global scope:
error: src/libs/core/exception.cpp:290: Fehler: expected constructor, destructor, or type conversion before »::« token
error: src/libs/core/exception.cpp:786: Fehler: expected `}' at end of input
error: make[4]: *** [exception.o] Fehler 1
error: make[3]: *** [.objs] Fehler 2
error: make[2]: *** [core] Fehler 2
error: make[1]: *** [libs] Fehler 2
error: make: *** [src] Fehler 2 info: make: Entering directory `'
 info: --&gt; Entering sub-directory src ---
 info:    --&gt; Entering sub-directory libs ---
 info:       --&gt; Entering sub-directory core ---
 info: make[4]: Für das Ziel »uncolored-gui« ist nichts zu tun.
 info:          &lt;-- Leaving core
 info:       --&gt; Entering sub-directory utils ---
 info: make[4]: Für das Ziel »uncolored-gui« ist nichts zu tun.
 info:          &lt;-- Leaving utils
 info:       --&gt; Entering sub-directory interface ---
 info: make[4]: Für das Ziel »uncolored-gui« ist nichts zu tun.
 info:          &lt;-- Leaving interface
 info:       --&gt; Entering sub-directory netcomm ---
 info: make[4]: Für das Ziel »uncolored-gui« ist nichts zu tun.
 info:          &lt;-- Leaving netcomm
 info:       --&gt; Entering sub-directory blackboard ---
 info: make[4]: Für das Ziel »uncolored-gui« ist nichts zu tun.
 info:          &lt;-- Leaving blackboard
 info:       --&gt; Entering sub-directory config ---
 info: make[4]: Für das Ziel »uncolored-gui« ist nichts zu tun.
 info:          &lt;-- Leaving config
 info:       --&gt; Entering sub-directory lua ---
 info: make[4]: Für das Ziel »uncolored-gui« ist nichts zu tun.
 info:          &lt;-- Leaving lua
 info:       --&gt; Entering sub-directory aspect ---
 info: make[4]: Für das Ziel »uncolored-gui« ist nichts zu tun.
 info:          &lt;-- Leaving aspect
 info:       --&gt; Entering sub-directory geometry ---
 info: make[4]: Für das Ziel »uncolored-gui« ist nichts zu tun.
 info:          &lt;-- Leaving geometry
 info:       --&gt; Entering sub-directory worldinfo_utils ---
 info: make[4]: Für das Ziel »uncolored-gui« ist nichts zu tun.
 info:          &lt;-- Leaving worldinfo_utils
 info:       &lt;-- Leaving libs
 info:    --&gt; Entering sub-directory interfaces ---
 info: make[3]: Für das Ziel »uncolored-gui« ist nichts zu tun.
 info:       &lt;-- Leaving interfaces
 info:    --&gt; Entering sub-directory mainapp ---
 info: make[3]: Für das Ziel »uncolored-gui« ist nichts zu tun.
 info:       &lt;-- Leaving mainapp
 info:    --&gt; Entering sub-directory firevision ---
 info:       --&gt; Entering sub-directory fvutils ---
 info: make[4]: Für das Ziel »uncolored-gui« ist nichts zu tun.
 info:          &lt;-- Leaving fvutils
 info:       --&gt; Entering sub-directory cams ---
 info: make[4]: Für das Ziel »uncolored-gui« ist nichts zu tun.
 info:          &lt;-- Leaving cams
 info:       --&gt; Entering sub-directory classifiers ---
 info: make[4]: Für das Ziel »uncolored-gui« ist nichts zu tun.
 info:          &lt;-- Leaving classifiers
 info:       --&gt; Entering sub-directory models ---
 info: make[4]: Für das Ziel »uncolored-gui« ist nichts zu tun.
 info:          &lt;-- Leaving models
 info:       --&gt; Entering sub-directory filters ---
 info: make[4]: Für das Ziel »uncolored-gui« ist nichts zu tun.
 info:          &lt;-- Leaving filters
 info:       --&gt; Entering sub-directory fvwidgets ---
 info: make[4]: Für das Ziel »uncolored-gui« ist nichts zu tun.
 info:          &lt;-- Leaving fvwidgets
 info:       --&gt; Entering sub-directory apps ---
 info:          --&gt; Entering sub-directory base ---
 info: make[5]: Für das Ziel »uncolored-gui« ist nichts zu tun.
 info:             &lt;-- Leaving base
 info:          --&gt; Entering sub-directory fountain ---
 info: make[5]: Für das Ziel »uncolored-gui« ist nichts zu tun.
 info:             &lt;-- Leaving fountain
 info:          --&gt; Entering sub-directory retriever ---
 info: make[5]: Für das Ziel »uncolored-gui« ist nichts zu tun.
 info:             &lt;-- Leaving retriever
 info:          --&gt; Entering sub-directory nao_ball ---
 info: make[5]: Für das Ziel »uncolored-gui« ist nichts zu tun.
 info:             &lt;-- Leaving nao_ball
 info:          --&gt; Entering sub-directory nao_loc ---
 info: make[5]: Für das Ziel »uncolored-gui« ist nichts zu tun.
 info:             &lt;-- Leaving nao_loc
 info:          --&gt; Entering sub-directory nao_goals ---
 info: make[5]: Für das Ziel »uncolored-gui« ist nichts zu tun.
 info:             &lt;-- Leaving nao_goals
 info:          &lt;-- Leaving apps
 info:       --&gt; Entering sub-directory tools ---
 info:          --- Compiling viewer.cpp (C++)
error: src/firevision/tools/viewer.cpp:26:38: Fehler: core/exceptions/software.h: Datei oder Verzeichnis nicht gefunden
error: src/firevision/tools/viewer.cpp:27:36: Fehler: utils/system/argparser.h: Datei oder Verzeichnis nicht gefunden
error: In Datei, eingefügt von src/firevision/tools/viewer.cpp:29:
error: src/firevision/cams/factory.h:29:28: Fehler: core/exception.h: Datei oder Verzeichnis nicht gefunden
error: In Datei, eingefügt von src/firevision/cams/shmem.h:31,
error:                  von src/firevision/tools/viewer.cpp:31:
error: src/firevision/fvutils/ipc/shm_image.h:29:27: Fehler: utils/ipc/shm.h: Datei oder Verzeichnis nicht gefunden
error: src/firevision/fvutils/ipc/shm_image.h:30:34: Fehler: utils/ipc/shm_lister.h: Datei oder Verzeichnis nicht gefunden
error: In Datei, eingefügt von src/firevision/fvutils/net/fuse_client_handler.h:29,
error:                  von src/firevision/cams/net.h:30,
error:                  von src/firevision/tools/viewer.cpp:34:
error: src/firevision/fvutils/net/fuse.h:32:42: Fehler: netcomm/utils/dynamic_buffer.h: Datei oder Verzeichnis nicht gefunden
error: In file included from src/firevision/tools/viewer.cpp:29:
error: src/firevision/cams/factory.h:38: Fehler: »fawkes« wurde nicht deklariert
error: src/firevision/cams/factory.h:38: Fehler: expected `{' before »Exception«
error: src/firevision/cams/factory.h:38: Fehler: Funktionsdefinition deklariert keine Parameter
error: src/firevision/cams/factory.h: In static member function »static C* CameraFactory::instance(const char*)«:
error: src/firevision/cams/factory.h:70: Fehler: »fawkes« wurde nicht deklariert
error: In file included from src/firevision/cams/shmem.h:31,
error:                  from src/firevision/tools/viewer.cpp:31:
error: src/firevision/fvutils/ipc/shm_image.h: At global scope:
error: src/firevision/fvutils/ipc/shm_image.h:61: Fehler: »fawkes« wurde nicht deklariert
error: src/firevision/fvutils/ipc/shm_image.h:61: Fehler: expected `{' before »SharedMemoryHeader«
error: src/firevision/fvutils/ipc/shm_image.h:61: Fehler: Funktionsdefinition deklariert keine Parameter
error: src/firevision/fvutils/ipc/shm_image.h:106: Fehler: »fawkes« wurde nicht deklariert
error: src/firevision/fvutils/ipc/shm_image.h:106: Fehler: expected `{' before »SharedMemoryLister«
error: src/firevision/fvutils/ipc/shm_image.h:106: Fehler: Funktionsdefinition deklariert keine Parameter
error: src/firevision/fvutils/ipc/shm_image.h:123: Fehler: »fawkes« wurde nicht deklariert
error: src/firevision/fvutils/ipc/shm_image.h:123: Fehler: expected `{' before »SharedMemory«
error: src/firevision/fvutils/ipc/shm_image.h:123: Fehler: Funktionsdefinition deklariert keine Parameter
error: In file included from src/firevision/fvutils/net/fuse_client_handler.h:29,
error:                  from src/firevision/cams/net.h:30,
error:                  from src/firevision/tools/viewer.cpp:34:
error: src/firevision/fvutils/net/fuse.h:179: Fehler: »fawkes« wurde nicht deklariert
error: src/firevision/fvutils/net/fuse.h:179: Fehler: ISO-C++ verbietet Deklaration von »dynamic_list_t« ohne Typ
error: src/firevision/fvutils/net/fuse.h:179: Fehler: expected »;« before »image_list«
error: src/firevision/fvutils/net/fuse.h:184: Fehler: »fawkes« wurde nicht deklariert
error: src/firevision/fvutils/net/fuse.h:184: Fehler: ISO-C++ verbietet Deklaration von »dynamic_list_t« ohne Typ
error: src/firevision/fvutils/net/fuse.h:184: Fehler: expected »;« before »lut_list«
error: In file included from src/firevision/tools/viewer.cpp:56:
error: src/firevision/fvutils/color/conversions.h: In function »void convert(colorspace_t, colorspace_t, unsigned char*, unsigned char*, unsigned int, unsigned int)«:
 info: make: Leaving directory `'
error: src/firevision/fvutils/color/conversions.h:117: Fehler: »fawkes« wurde nicht deklariert
error: src/firevision/fvutils/color/conversions.h: In function »void grayscale(colorspace_t, unsigned char*, unsigned char*, unsigned int, unsigned int)«:
error: src/firevision/fvutils/color/conversions.h:137: Fehler: »fawkes« wurde nicht deklariert
error: src/firevision/fvutils/color/conversions.h:137: Fehler: expected `;' before »e«
error: src/firevision/fvutils/color/conversions.h:140: Fehler: »e« wurde in diesem Gültigkeitsbereich nicht definiert
error: src/firevision/tools/viewer.cpp: At global scope:
error: src/firevision/tools/viewer.cpp:58: Fehler: »fawkes« ist kein Namensbereichs-Name
error: src/firevision/tools/viewer.cpp:58: Fehler: expected namespace-name before »;« token
error: src/firevision/tools/viewer.cpp: In function »int main(int, char**)«:
error: src/firevision/tools/viewer.cpp:108: Fehler: »ArgumentParser« wurde in diesem Gültigkeitsbereich nicht definiert
error: src/firevision/tools/viewer.cpp:108: Fehler: expected `;' before »argp«
error: src/firevision/tools/viewer.cpp:116: Fehler: »argp« wurde in diesem Gültigkeitsbereich nicht definiert
error: src/firevision/tools/viewer.cpp:162: Fehler: »OutOfBoundsException« wurde in diesem Gültigkeitsbereich nicht definiert
error: src/firevision/tools/viewer.cpp:167: Fehler: »IllegalArgumentException« wurde in diesem Gültigkeitsbereich nicht definiert
error: src/firevision/tools/viewer.cpp:185: Fehler: »Exception« wurde in diesem Gültigkeitsbereich nicht definiert
error: src/firevision/tools/viewer.cpp:192: Fehler: expected type-specifier before »Exception«
error: src/firevision/tools/viewer.cpp:192: Fehler: expected `)' before »&amp;« token
error: src/firevision/tools/viewer.cpp:192: Fehler: expected `{' before »&amp;« token
error: src/firevision/tools/viewer.cpp:192: Fehler: »e« wurde in diesem Gültigkeitsbereich nicht definiert
error: src/firevision/tools/viewer.cpp:192: Fehler: expected `;' before »)« token
error: make[4]: *** [viewer.o] Fehler 1
error: make[3]: *** [.objs] Fehler 2
error: make[2]: *** [tools] Fehler 2
error: make[1]: *** [firevision] Fehler 2
error: make: *** [src] Fehler 2


More information about the fawkes-trac mailing list