[Trac] [Failed Build] AllemaniACs [1083] Fawkes

AllemaniACs trac-notifications at lists.kbsg.rwth-aachen.de
Wed May 21 17:50:33 CEST 2008


  Failed build of AllemaniACs [1083]
---------------------------------------------------------------------

  Changeset:             1083  -  <https://lechuck.informatik.rwth-aachen.de:2342/trac/changeset/1083>
  Committed by:          tim

  Build Configuration:   Fawkes
  Build Slave:           hook
  Build Number:          639  -  <https://lechuck.informatik.rwth-aachen.de:2342/trac/build/Fawkes/639>

  Failed Steps:          build: make failed (512), build: make failed (512)
  Failure Log:           
  
 info: make: Entering directory `'
 info: --&gt; Entering sub-directory src ---
 info:    --&gt; Entering sub-directory libs ---
 info:       --&gt; Entering sub-directory core ---
 info:          --- Compiling exception.cpp (C++)
 info:          --- Compiling plugin.cpp (C++)
 info:          --- Compiling exceptions/software.cpp (C++)
 info:          --- Compiling exceptions/system.cpp (C++)
 info:          --- Compiling threading/barrier.cpp (C++)
 info:          --- Compiling threading/mutex.cpp (C++)
 info:          --- Compiling threading/mutex_locker.cpp (C++)
 info:          --- Compiling threading/read_write_lock.cpp (C++)
 info:          --- Compiling threading/refc_rwlock.cpp (C++)
 info:          --- Compiling threading/spinlock.cpp (C++)
 info:          --- Compiling threading/thread_collector.cpp (C++)
 info:          --- Compiling threading/thread.cpp (C++)
 info:          --- Compiling threading/thread_finalizer.cpp (C++)
 info:          --- Compiling threading/thread_initializer.cpp (C++)
 info:          --- Compiling threading/thread_list.cpp (C++)
 info:          --- Compiling threading/thread_notification_listener.cpp (C++)
 info:          --- Compiling threading/wait_condition.cpp (C++)
 info:          --- Compiling utils/refcount.cpp (C++)
 info:          === Linking lib libcore ---
 info:          &lt;-- Leaving core
 info:       --&gt; Entering sub-directory utils ---
 info:          --- Compiling constraints/dependency.cpp (C++)
 info:          --- Compiling ipc/msg.cpp (C++)
 info:          --- Compiling ipc/semset.cpp (C++)
 info:          --- Compiling ipc/shm.cpp (C++)
 info:          --- Compiling ipc/shm_exceptions.cpp (C++)
 info:          --- Compiling logging/component.cpp (C++)
 info:          --- Compiling logging/console.cpp (C++)
 info:          --- Compiling logging/factory.cpp (C++)
 info:          --- Compiling logging/file.cpp (C++)
 info:          --- Compiling logging/liblogger.cpp (C++)
 info:          --- Compiling logging/logger.cpp (C++)
 info:          --- Compiling logging/multi.cpp (C++)
 info:          --- Compiling misc/sigmangler.cpp (C++)
 info:          --- Compiling misc/string_compare.cpp (C++)
 info:          --- Compiling misc/string_conversions.cpp (C++)
 info:          --- Compiling plugin/load_thread.cpp (C++)
 info:          --- Compiling plugin/plugin_loader.cpp (C++)
 info:          --- Compiling search/astar.cpp (C++)
 info:          --- Compiling system/argparser.cpp (C++)
 info:          --- Compiling system/file.cpp (C++)
 info:          --- Compiling system/hostinfo.cpp (C++)
 info:          --- Compiling system/signal.cpp (C++)
 info:          --- Compiling time/clock.cpp (C++)
 info:          --- Compiling time/simts.cpp (C++)
 info:          --- Compiling time/time.cpp (C++)
 info:          --- Compiling time/tracker.cpp (C++)
 info:          --- Compiling time/wait.cpp (C++)
 info:          --- Compiling time/watch.cpp (C++)
 info:          --- Compiling system/dynamic_module/module.cpp (C++)
 info:          --- Compiling system/dynamic_module/module_dl.cpp (C++)
 info:          --- Compiling system/dynamic_module/module_manager_factory.cpp (C++)
 info:          === Linking lib libutils ---
 info:          --- Generating Lua package C++ file utils_tolua.cpp
 info:          --- Compiling utils_tolua.cpp (C++)
 info:          === Linking lib lua/utils ---
 info:          &lt;-- Leaving utils
 info:       --&gt; Entering sub-directory interface ---
 info:          --- Compiling interface.cpp (C++)
 info:          --- Compiling interface_info.cpp (C++)
 info:          --- Compiling message.cpp (C++)
 info:          --- Compiling message_queue.cpp (C++)
 info:          === Linking lib libinterface ---
 info:          --- Generating Lua package C++ file interface_tolua.cpp
 info:          --- Compiling interface_tolua.cpp (C++)
 info:          === Linking lib lua/interface ---
 info:          &lt;-- Leaving interface
 info:       --&gt; Entering sub-directory netcomm ---
 info:          --- Compiling dns-sd/avahi_resolver_handler.cpp (C++)
 info:          --- Compiling dns-sd/avahi_thread.cpp (C++)
 info:          --- Compiling fawkes/client.cpp (C++)
 info:          --- Compiling fawkes/client_handler.cpp (C++)
 info:          --- Compiling fawkes/handler.cpp (C++)
 info:          --- Compiling fawkes/hub.cpp (C++)
 info:          --- Compiling fawkes/message_content.cpp (C++)
 info:          --- Compiling fawkes/message.cpp (C++)
 info:          --- Compiling fawkes/message_queue.cpp (C++)
 info:          --- Compiling fawkes/server_client_thread.cpp (C++)
 info:          --- Compiling fawkes/server_thread.cpp (C++)
 info:          --- Compiling fawkes/transceiver.cpp (C++)
 info:          --- Compiling service_discovery/dummy_service_browser.cpp (C++)
 info:          --- Compiling service_discovery/dummy_service_publisher.cpp (C++)
 info:          --- Compiling service_discovery/service_browser.cpp (C++)
 info:          --- Compiling service_discovery/service.cpp (C++)
 info:          --- Compiling service_discovery/service_publisher.cpp (C++)
 info:          --- Compiling socket/datagram.cpp (C++)
 info:          --- Compiling socket/datagram_multicast.cpp (C++)
 info:          --- Compiling socket/socket.cpp (C++)
 info:          --- Compiling socket/stream.cpp (C++)
 info:          --- Compiling utils/acceptor_thread.cpp (C++)
 info:          --- Compiling utils/dynamic_buffer.cpp (C++)
 info:          --- Compiling utils/exceptions.cpp (C++)
 info:          --- Compiling utils/incoming_connection_handler.cpp (C++)
 info:          --- Compiling utils/network_logger.cpp (C++)
 info:          --- Compiling utils/resolver.cpp (C++)
 info:          --- Compiling utils/resolver_thread.cpp (C++)
 info:          --- Compiling utils/string_content.cpp (C++)
 info:          --- Compiling worldinfo/decrypt.cpp (C++)
 info:          --- Compiling worldinfo/encrypt.cpp (C++)
 info:          --- Compiling worldinfo/enums.cpp (C++)
 info:          --- Compiling worldinfo/handler.cpp (C++)
 info:          --- Compiling worldinfo/transceiver.cpp (C++)
 info:          === Linking lib libnetcomm ---
 info:          &lt;-- Leaving netcomm
 info:       --&gt; Entering sub-directory blackboard ---
 info:          --- Compiling blackboard.cpp (C++)
 info:          --- Compiling instance_factory.cpp (C++)
 info:          --- Compiling interface_listener.cpp (C++)
 info:          --- Compiling interface_manager.cpp (C++)
 info:          --- Compiling interface_observer.cpp (C++)
 info:          --- Compiling interface_proxy.cpp (C++)
 info:          --- Compiling memory_manager.cpp (C++)
 info:          --- Compiling message_manager.cpp (C++)
 info:          --- Compiling net_ilist_content.cpp (C++)
 info:          --- Compiling net_interface_listener.cpp (C++)
 info:          --- Compiling network_handler.cpp (C++)
 info:          --- Compiling notifier.cpp (C++)
 info:          --- Compiling remote.cpp (C++)
 info:          --- Compiling shmem_header.cpp (C++)
 info:          --- Compiling shmem_lister.cpp (C++)
 info:          === Linking lib libblackboard ---
 info:          &lt;-- Leaving blackboard
 info:       --&gt; Entering sub-directory config ---
 info:          --- Compiling change_handler.cpp (C++)
 info:          --- Compiling config.cpp (C++)
 info:          --- Compiling netconf.cpp (C++)
 info:          --- Compiling net_list_content.cpp (C++)
 info:          --- Compiling sqlite.cpp (C++)
 info:          === Linking lib libconfig ---
 info:          --- Generating Lua package C++ file config_tolua.cpp
 info:          --- Compiling config_tolua.cpp (C++)
 info:          === Linking lib lua/config ---
 info:          &lt;-- Leaving config
 info:       --&gt; Entering sub-directory aspect ---
 info:          --- Compiling blackboard.cpp (C++)
 info:          --- Compiling blocked_timing.cpp (C++)
 info:          --- Compiling clock.cpp (C++)
 info:          --- Compiling configurable.cpp (C++)
 info:          --- Compiling fawkes_network.cpp (C++)
 info:          --- Compiling inifin.cpp (C++)
 info:          --- Compiling logging.cpp (C++)
 info:          --- Compiling network.cpp (C++)
 info:          --- Compiling thread_producer.cpp (C++)
 info:          --- Compiling time_source.cpp (C++)
 info:          --- Compiling vision.cpp (C++)
 info:          --- Compiling vision_master.cpp (C++)
 info:          === Linking lib libaspects ---
 info:          &lt;-- Leaving aspect
 info:       --&gt; Entering sub-directory geometry ---
 info:          --- Compiling geom_obj.cpp (C++)
 info:          --- Compiling hom_coord.cpp (C++)
 info:          --- Compiling hom_point.cpp (C++)
 info:          --- Compiling hom_polar.cpp (C++)
 info:          --- Compiling hom_pose.cpp (C++)
 info:          --- Compiling hom_transform.cpp (C++)
 info:          --- Compiling hom_vector.cpp (C++)
 info:          --- Compiling line.cpp (C++)
 info:          --- Compiling matrix.cpp (C++)
 info:          --- Compiling vector.cpp (C++)
 info:          === Linking lib libgeometry ---
 info:          &lt;-- Leaving geometry
 info:       --&gt; Entering sub-directory worldinfo_utils ---
 info:          --- Compiling data_container.cpp (C++)
 info:          === Linking lib libworldinfo_utils ---
 info:          &lt;-- Leaving worldinfo_utils
 info:       &lt;-- Leaving libs
 info:    --&gt; Entering sub-directory interfaces ---
 info:       --- Compiling generator/constant.cpp (C++)
 info:       --- Compiling generator/cpp_generator.cpp (C++)
 info:       --- Compiling generator/digest.cpp (C++)
 info:       --- Compiling generator/enum_constant.cpp (C++)
 info:       --- Compiling generator/field.cpp (C++)
 info:       --- Compiling generator/main.cpp (C++)
 info:       --- Compiling generator/message.cpp (C++)
 info:       --- Compiling generator/parser.cpp (C++)
 info:       --- Compiling generator/tolua_generator.cpp (C++)
 info:       --- Compiling generator/type_checker.cpp (C++)
 info:       === Linking interface_generator ---
 info:       --&gt; Generating battery.cpp (Interface XML Template)
 info:       --&gt; Generating facer.cpp (Interface XML Template)
 info:       --&gt; Generating gamestate.cpp (Interface XML Template)
 info:       --&gt; Generating kicker.cpp (Interface XML Template)
 info:       --&gt; Generating motor.cpp (Interface XML Template)
 info:       --&gt; Generating navigator.cpp (Interface XML Template)
 info:       --&gt; Generating object.cpp (Interface XML Template)
 info:       --&gt; Generating skiller.cpp (Interface XML Template)
 info:       --&gt; Generating test.cpp (Interface XML Template)
 info:       --- Compiling battery.cpp (C++)
 info:       --- Compiling facer.cpp (C++)
 info:       --- Compiling gamestate.cpp (C++)
 info:       --- Compiling kicker.cpp (C++)
 info:       --- Compiling motor.cpp (C++)
 info:       --- Compiling navigator.cpp (C++)
 info:       --- Compiling object.cpp (C++)
 info:       --- Compiling skiller.cpp (C++)
 info:       --- Compiling test.cpp (C++)
 info:       === Linking lib libinterfaces ---
 info:       --- Generating Lua package C++ file interfaces_tolua.cpp
 info:       --- Compiling interfaces_tolua.cpp (C++)
 info:       === Linking lib lua/interfaces ---
 info:       &lt;-- Leaving interfaces
 info:    --&gt; Entering sub-directory mainapp ---
 info:       --- Compiling plugin_list_message.cpp (C++)
 info:       === Linking lib libfawkesmainappmsgs ---
 info:       --- Compiling config_manager.cpp (C++)
 info:       --- Compiling main.cpp (C++)
 info:       --- Compiling main_thread.cpp (C++)
 info:       --- Compiling network_manager.cpp (C++)
 info:       --- Compiling plugin_manager.cpp (C++)
 info:       --- Compiling thread_inifin.cpp (C++)
 info:       --- Compiling thread_manager.cpp (C++)
 info:       === Linking fawkes ---
 info:       &lt;-- Leaving mainapp
 info:    --&gt; Entering sub-directory firevision ---
 info:       --&gt; Entering sub-directory fvutils ---
 info:          --- Compiling adapters/iplimage.cpp (C++)
 info:          --- Compiling base/roi.cpp (C++)
 info:          --- Compiling base/vision_master.cpp (C++)
 info:          --- Compiling camera/tracker.cpp (C++)
 info:          --- Compiling color/bayer.cpp (C++)
 info:          --- Compiling color/colorspaces.cpp (C++)
 info:          --- Compiling colormap/cmfile_block.cpp (C++)
 info:          --- Compiling colormap/cmfile.cpp (C++)
 info:          --- Compiling colormap/cmfile_yuvblock.cpp (C++)
 info:          --- Compiling colormap/colormap.cpp (C++)
 info:          --- Compiling colormap/generator.cpp (C++)
 info:          --- Compiling colormap/yuvcm.cpp (C++)
 info:          --- Compiling color/rgb.cpp (C++)
 info:          --- Compiling color/rgbyuv.cpp (C++)
 info:          --- Compiling color/yuv.cpp (C++)
 info:          --- Compiling color/yuvrgb.cpp (C++)
 info:          --- Compiling color/zauberstab.cpp (C++)
 info:          --- Compiling compression/imagecompressor.cpp (C++)
 info:          --- Compiling compression/imagedecompressor.cpp (C++)
 info:          --- Compiling compression/jpeg_compressor.cpp (C++)
 info:          --- Compiling compression/jpeg_decompressor.cpp (C++)
 info:          --- Compiling draw/drawer.cpp (C++)
 info:          --- Compiling fileformat/fvfile_block.cpp (C++)
 info:          --- Compiling fileformat/fvfile.cpp (C++)
 info:          --- Compiling ipc/fieldinfo_sender.cpp (C++)
 info:          --- Compiling ipc/shm_image.cpp (C++)
 info:          --- Compiling ipc/shm_lut.cpp (C++)
 info:          --- Compiling net/fuse_client.cpp (C++)
 info:          --- Compiling net/fuse_client_handler.cpp (C++)
 info:          --- Compiling net/fuse_image_content.cpp (C++)
 info:          --- Compiling net/fuse_imagelist_content.cpp (C++)
 info:          --- Compiling net/fuse_lut_content.cpp (C++)
 info:          --- Compiling net/fuse_lutlist_content.cpp (C++)
 info:          --- Compiling net/fuse_message_content.cpp (C++)
 info:          --- Compiling net/fuse_message.cpp (C++)
 info:          --- Compiling net/fuse_server_client_thread.cpp (C++)
 info:          --- Compiling net/fuse_server.cpp (C++)
 info:          --- Compiling net/fuse_transceiver.cpp (C++)
 info:          --- Compiling readers/fvraw.cpp (C++)
 info:          --- Compiling readers/jpeg.cpp (C++)
 info:          --- Compiling readers/png.cpp (C++)
 info:          --- Compiling readers/pnm.cpp (C++)
 info:          --- Compiling readers/reader.cpp (C++)
 info:          --- Compiling recognition/faces.cpp (C++)
 info:          --- Compiling rectification/rectfile.cpp (C++)
 info:          --- Compiling rectification/rectinfo_block.cpp (C++)
 info:          --- Compiling rectification/rectinfo.cpp (C++)
 info:          --- Compiling rectification/rectinfo_lut_block.cpp (C++)
 info:          --- Compiling scalers/lossy.cpp (C++)
 info:          --- Compiling scalers/scaler.cpp (C++)
 info:          --- Compiling statistical/histogram_block.cpp (C++)
 info:          --- Compiling statistical/histogram.cpp (C++)
 info:          --- Compiling statistical/histogram_file.cpp (C++)
 info:          --- Compiling statistical/imagediff.cpp (C++)
 info:          --- Compiling system/camargp.cpp (C++)
 info:          --- Compiling writers/compressed.cpp (C++)
 info:          --- Compiling writers/fvraw.cpp (C++)
 info:          --- Compiling writers/jpeg.cpp (C++)
 info:          --- Compiling writers/png.cpp (C++)
 info:          --- Compiling writers/pnm.cpp (C++)
 info:          --- Compiling writers/seq_writer.cpp (C++)
 info:          --- Compiling writers/writer.cpp (C++)
 info:          --- Compiling colormap/bayes/bayes_generator.cpp (C++)
 info:          --- Compiling colormap/bayes/bayes_histos_to_lut.cpp (C++)
 info:          --- Compiling recognition/forest/forest_aux.cpp (C++)
 info:          === Linking lib libfvutils ---
 info:          &lt;-- Leaving fvutils
 info:       --&gt; Entering sub-directory cams ---
 info:          --- Compiling camera.cpp (C++)
 info:          --- Compiling cameracontrol.cpp (C++)
 info:          --- Compiling cam_exceptions.cpp (C++)
 info:          --- Compiling factory.cpp (C++)
 info:          --- Compiling controlfactory.cpp (C++)
 info:          --- Compiling firewire.cpp (C++)
 info:          --- Compiling bumblebee2.cpp (C++)
 info:          --- Compiling fileloader.cpp (C++)
 info:          --- Compiling net.cpp (C++)
 info:          --- Compiling shmem.cpp (C++)
 info:          === Linking lib libfvcams ---
 info:          &lt;-- Leaving cams
 info:       --&gt; Entering sub-directory classifiers ---
 info:          --- Compiling border_shrinker.cpp (C++)
 info:          --- Compiling classifier.cpp (C++)
 info:          --- Compiling faces.cpp (C++)
 info:          --- Compiling shrinker.cpp (C++)
 info:          --- Compiling simple.cpp (C++)
 info:          --- Compiling square_shrinker.cpp (C++)
 info:          === Linking lib libfvclassifiers ---
 info:          &lt;-- Leaving classifiers
 info:       --&gt; Entering sub-directory models ---
 info:          --- Compiling color/colormodel.cpp (C++)
 info:          --- Compiling color/lookuptable.cpp (C++)
 info:          --- Compiling color/thresholds.cpp (C++)
 info:          --- Compiling global_position/globalpositionmodel.cpp (C++)
 info:          --- Compiling global_position/globfromrel.cpp (C++)
 info:          --- Compiling global_position/omni_global.cpp (C++)
 info:          --- Compiling mirror/bulb.cpp (C++)
 info:          --- Compiling mirror/mirrormodel.cpp (C++)
 info:          --- Compiling relative_position/box_relative.cpp (C++)
 info:          --- Compiling relative_position/front_ball.cpp (C++)
 info:          --- Compiling relative_position/omni_relative.cpp (C++)
 info:          --- Compiling relative_position/relativepositionmodel.cpp (C++)
 info:          --- Compiling scanlines/beams.cpp (C++)
 info:          --- Compiling scanlines/cornerhorizon.cpp (C++)
 info:          --- Compiling scanlines/grid.cpp (C++)
 info:          --- Compiling scanlines/radial.cpp (C++)
 info:          --- Compiling scanlines/star.cpp (C++)
 info:          --- Compiling shape/circle.cpp (C++)
 info:          --- Compiling shape/ht_lines.cpp (C++)
 info:          --- Compiling shape/line.cpp (C++)
 info:          --- Compiling shape/rcd_circle.cpp (C++)
 info:          --- Compiling shape/rht_circle.cpp (C++)
 info:          --- Compiling shape/rht_lines.cpp (C++)
 info:          --- Compiling shape/shapemodel.cpp (C++)
 info:          --- Compiling velocity/globfromrel.cpp (C++)
 info:          --- Compiling velocity/globvelo.cpp (C++)
 info:          --- Compiling velocity/relvelo.cpp (C++)
 info:          --- Compiling velocity/velocitymodel.cpp (C++)
 info:          --- Compiling mirror/bulb/bulb_generator.cpp (C++)
 info:          --- Compiling mirror/bulb/bulb_sampler.cpp (C++)
 info:          --- Compiling shape/accumulators/fc_accum.cpp (C++)
 info:          --- Compiling shape/accumulators/fit_accum.cpp (C++)
 info:          --- Compiling shape/accumulators/ht_accum.cpp (C++)
 info:          === Linking lib libfvmodels ---
 info:          &lt;-- Leaving models
 info:       --&gt; Entering sub-directory filters ---
 info:          --- Omitting morphology/closing filter (No IPP installed)
 info:          --- Omitting morphology/dilation filter (No IPP installed)
 info:          --- Omitting morphology/erosion filter (No IPP installed)
 info:          --- Omitting morphology/geodesic_dilation filter (No IPP installed)
 info:          --- Omitting morphology/geodesic_erosion filter (No IPP installed)
 info:          --- Omitting morphology/morphologicalfilter filter (No IPP installed)
 info:          --- Omitting morphology/opening filter (No IPP installed)
 info:          --- Omitting morphology/segenerator filter (No IPP installed)
 info:          --- Omitting morphology/tophat_closing filter (No IPP installed)
 info:          --- Omitting gauss filter (No IPP installed)
 info:          --- Omitting hipass filter (No IPP installed)
 info:          --- Omitting laplace filter (No IPP installed)
 info:          --- Omitting median filter (No IPP installed)
 info:          --- Omitting or filter (No IPP installed)
 info:          --- Omitting sharpen filter (No IPP installed)
 info:          --- Omitting sobel filter (No IPP installed)
 info:          --- Omitting threshold filter (No IPP installed)
 info:          --- Omitting morphology/dilation filter (No IPP installed)
 info:          --- Omitting morphology/erosion filter (No IPP installed)
 info:          --- Compiling compare.cpp (C++)
 info:          --- Compiling difference.cpp (C++)
 info:          --- Compiling filter.cpp (C++)
 info:          --- Compiling hor_search.cpp (C++)
 info:          --- Compiling hv_search.cpp (C++)
 info:          --- Compiling invert.cpp (C++)
 info:          --- Compiling max.cpp (C++)
 info:          --- Compiling min.cpp (C++)
 info:          --- Compiling rectify.cpp (C++)
 info:          --- Compiling roidraw.cpp (C++)
 info:          --- Compiling segment_color.cpp (C++)
 info:          --- Compiling segment.cpp (C++)
 info:          --- Compiling segment_scanline.cpp (C++)
 info:          --- Compiling shape_remover.cpp (C++)
 info:          --- Compiling sum.cpp (C++)
 info:          --- Compiling unwarp.cpp (C++)
 info:          === Linking lib libfvfilters ---
 info:          &lt;-- Leaving filters
 info:       --&gt; Entering sub-directory stereo ---
 info:          --- Omitting Triclops SDK support (Triclops SDK not available on 64-bit systems)
 info:          --- Compiling stereo_processor.cpp (C++)
 info:          === Linking lib libfvstereo ---
 info:          &lt;-- Leaving stereo
 info:       --&gt; Entering sub-directory fvwidgets ---
 info:          --- Compiling image_display.cpp (C++)
 info:          --- Compiling sdl_keeper.cpp (C++)
 info:          === Linking lib libfvwidgets ---
 info:          &lt;-- Leaving fvwidgets
 info:       --&gt; Entering sub-directory apps ---
 info:          --&gt; Entering sub-directory base ---
 info:             --- Compiling acquisition_thread.cpp (C++)
 info:             --- Compiling aqt_vision_threads.cpp (C++)
 info:             --- Compiling base_thread.cpp (C++)
 info:             --- Compiling fvbase_plugin.cpp (C++)
 info:             === Linking plugin fvbase ---
 info:             &lt;-- Leaving base
 info:          --&gt; Entering sub-directory fountain ---
 info:             --- Compiling fountain_thread.cpp (C++)
 info:             --- Compiling fountain_plugin.cpp (C++)
 info:             === Linking plugin fvfountain ---
 info:             &lt;-- Leaving fountain
 info:          --&gt; Entering sub-directory retriever ---
 info:             --- Compiling fvretriever_plugin.cpp (C++)
 info:             --- Compiling retriever_thread.cpp (C++)
 info:             === Linking plugin fvretriever ---
 info:             &lt;-- Leaving retriever
 info:          --&gt; Entering sub-directory omni_ball ---
 info:             --- Compiling pipeline_thread.cpp (C++)
 info:             --- Compiling plugin.cpp (C++)
 info:             === Linking plugin fvomniball ---
 info:             &lt;-- Leaving omni_ball
 info:          --&gt; Entering sub-directory omni_field ---
 info:             --- Compiling pipeline_thread.cpp (C++)
 info:             --- Compiling plugin.cpp (C++)
 info:             === Linking plugin fvomnifield ---
 info:             &lt;-- Leaving omni_field
 info:          --&gt; Entering sub-directory omni_localizer ---
 info:             --- Compiling field.cpp (C++)
 info:             --- Compiling lineclassifier.cpp (C++)
 info:             --- Compiling mcl.cpp (C++)
 info:             --- Compiling pipeline_thread.cpp (C++)
 info:             --- Compiling plugin.cpp (C++)
 info:             === Linking plugin fvomnilocalizer ---
 info:             &lt;-- Leaving omni_localizer
 info:          &lt;-- Leaving apps
 info:       --&gt; Entering sub-directory tools ---
 info:          --- Not building fvtricalcdisp (no Triclops SDK support)
 info:          --- Building fvbb2rectlut w/o retrieval and limited verification support (no Triclops SDK)
 info:          --- Compiling shmem.cpp (C++)
 info:          === Linking fvshmem ---
 info:          --- Compiling net.cpp (C++)
 info:          === Linking fvnet ---
 info:          --- Compiling bb2rectlut.cpp (C++)
 info:          === Linking fvbb2rectlut ---
 info:          --- Compiling converter.cpp (C++)
 info:          === Linking fvconverter ---
 info:          --- Compiling listfwcams.cpp (C++)
 info:          === Linking fvlistfwcams ---
 info:          --- Compiling bb2gettric.cpp (C++)
 info:          === Linking fvbb2gettric ---
 info:          --- Compiling stereodecoder.cpp (C++)
 info:          === Linking fvstereodecoder ---
 info:          --- Compiling bb2info.cpp (C++)
 info:          === Linking fvbb2info ---
 info:          --&gt; Entering sub-directory firestation ---
 info: make[6]: Für das Ziel »uncolored-all« ist nichts zu tun.
 info:             &lt;-- Leaving firestation
 info:          &lt;-- Leaving tools
 info:       &lt;-- Leaving firevision
 info:    --&gt; Entering sub-directory plugins ---
 info:       --&gt; Entering sub-directory battery ---
 info:          --- Compiling battery_plugin.cpp (C++)
 info:          --- Compiling battery_thread.cpp (C++)
 info:          === Linking plugin battery ---
 info:          &lt;-- Leaving battery
 info:       --&gt; Entering sub-directory kicker ---
 info:          --- Compiling kicker_plugin.cpp (C++)
 info:          --- Compiling kicker_thread.cpp (C++)
 info:          --- Compiling kicker_control.cpp (C++)
 info:          === Linking plugin kicker ---
 info:          &lt;-- Leaving kicker
 info:       --&gt; Entering sub-directory navigator ---
 info:          --&gt; Entering sub-directory gts ---
 info:             --- Compiling gts_obstacle.c (C)
 info:             === Linking lib libgts_obstacle ---
 info:             &lt;-- Leaving gts
 info:          --&gt; Entering sub-directory fuzzy ---
 info:             --- Compiling fuzzy_controller.cpp (C++)
 info:             --- Compiling fuzzy_partition.cpp (C++)
 info:             --- Compiling fuzzy_set.cpp (C++)
 info:             --- Compiling mamdani_fuzzy_controller.cpp (C++)
 info:             --- Compiling potential_field_controller.cpp (C++)
 info:             --- Compiling smoothing_controller.cpp (C++)
 info:             --- Compiling trapezium_set.cpp (C++)
 info:             --- Compiling triangle_set.cpp (C++)
 info:             === Linking lib libfuzzy ---
 info:             &lt;-- Leaving fuzzy
 info:          --&gt; Entering sub-directory libnavi ---
 info:             --- Compiling npoint.cpp (C++)
 info:             --- Compiling obstacle.cpp (C++)
 info:             --- Compiling nline.cpp (C++)
 info:             --- Compiling navigator_messages.cpp (C++)
 info:             === Linking lib libnavigator ---
 info:             &lt;-- Leaving libnavi
 info:          --&gt; Entering sub-directory robot_motion ---
 info:             --- Compiling motion_model.cpp (C++)
 info:             --- Compiling omni_motion_model.cpp (C++)
 info:             --- Compiling velocity_controller.cpp (C++)
 info:             --- Compiling linear_velocity_controller.cpp (C++)
 info:             --- Compiling pid_controller.cpp (C++)
 info:             === Linking lib librobotmotion ---
 info:             &lt;-- Leaving robot_motion
 info:          --- Compiling navigator_plugin.cpp (C++)
 info:          --- Compiling navigator_thread.cpp (C++)
 info:          --- Compiling joystick_control.cpp (C++)
 info:          --- Compiling motor_thread.cpp (C++)
 info:          --- Compiling navigator_net_thread.cpp (C++)
 info:          --- Compiling navigator.cpp (C++)
 info:          --- Compiling pathfinder.cpp (C++)
 info:          --- Compiling path_state.cpp (C++)
 info:          === Linking plugin navigator ---
 info:          &lt;-- Leaving navigator
 info:       --&gt; Entering sub-directory worldmodel ---
 info:          --- Compiling net_thread.cpp (C++)
 info:          --- Compiling wm_thread.cpp (C++)
 info:          --- Compiling worldmodel_plugin.cpp (C++)
 info:          === Linking plugin worldmodel ---
 info:          &lt;-- Leaving worldmodel
 info:       --&gt; Entering sub-directory skiller ---
 info:          --- Compiling exec_thread.cpp (C++)
 info:          --- Compiling exec_thread_inotify.cpp (C++)
 info:          --- Compiling liaison_thread.cpp (C++)
 info:          --- Compiling skiller_plugin.cpp (C++)
 info:          === Linking plugin skiller ---
 info:          --&gt; Entering sub-directory consoletool ---
 info:             --- Compiling skillet.cpp (C++)
 info:             === Linking skillet ---
 info:             &lt;-- Leaving consoletool
 info:          &lt;-- Leaving skiller
 info:       &lt;-- Leaving plugins
 info:    --&gt; Entering sub-directory tools ---
 info:       --&gt; Entering sub-directory blackboard ---
 info:          --- Compiling bb_cleanup.cpp (C++)
 info:          === Linking bb_cleanup ---
 info:          --- Compiling bb_list.cpp (C++)
 info:          === Linking bb_list ---
 info:          --- Compiling bb_meminfo.cpp (C++)
 info:          === Linking bb_meminfo ---
 info:          &lt;-- Leaving blackboard
 info:       --&gt; Entering sub-directory plugin ---
 info:          --- Compiling main.cpp (C++)
 info:          --- Compiling plugin_tool.cpp (C++)
 info:          === Linking plugin ---
 info:          &lt;-- Leaving plugin
 info:       --&gt; Entering sub-directory logview ---
 info:          --- Compiling main.cpp (C++)
 info:          === Linking logview ---
 info:          &lt;-- Leaving logview
 info:       --&gt; Entering sub-directory config ---
 info:          --- Compiling main.cpp (C++)
 info:          === Linking config ---
 info:          &lt;-- Leaving config
 info:       --&gt; Entering sub-directory joystick ---
 info:          --- Compiling joystick_tool.cpp (C++)
error: src/tools/joystick/joystick_tool.h:34: Fehler: expected class-name before »{« token
error: cc1plus: warnings being treated as errors
error: src/tools/joystick/joystick_tool.h:34: Warnung: »class JoystickTool« hat virtuelle Funktionen aber nicht-virtuellen Destruktor
error: src/tools/joystick/joystick_tool.cpp: In constructor »JoystickTool::JoystickTool(const char*)«:
error: src/tools/joystick/joystick_tool.cpp:85: Fehler: invalid use of undefined type »struct FawkesNetworkClient«
error: src/tools/joystick/joystick_tool.h:30: Fehler: forward declaration of »struct FawkesNetworkClient«
error: src/tools/joystick/joystick_tool.cpp:90: Fehler: invalid use of undefined type »struct FawkesNetworkClient«
error: src/tools/joystick/joystick_tool.h:30: Fehler: forward declaration of »struct FawkesNetworkClient«
 info: make: Leaving directory `'
error: src/tools/joystick/joystick_tool.cpp:92: Fehler: expected type-specifier before »SocketException«
error: src/tools/joystick/joystick_tool.cpp:92: Fehler: expected `)' before »&amp;« token
error: src/tools/joystick/joystick_tool.cpp:92: Fehler: expected `{' before »&amp;« token
error: src/tools/joystick/joystick_tool.cpp:92: Fehler: »e« wurde in diesem Gültigkeitsbereich nicht definiert
error: src/tools/joystick/joystick_tool.cpp:92: Fehler: expected `;' before »)« token
error: src/tools/joystick/joystick_tool.cpp:97: Fehler: invalid use of undefined type »struct FawkesNetworkClient«
error: src/tools/joystick/joystick_tool.h:30: Fehler: forward declaration of »struct FawkesNetworkClient«
error: src/tools/joystick/joystick_tool.cpp:98: Fehler: invalid use of undefined type »struct FawkesNetworkClient«
error: src/tools/joystick/joystick_tool.h:30: Fehler: forward declaration of »struct FawkesNetworkClient«
error: src/tools/joystick/joystick_tool.cpp:99: Fehler: »MSG_PLUGIN_SUBSCRIBE_WATCH« wurde in diesem Gültigkeitsbereich nicht definiert
error: src/tools/joystick/joystick_tool.cpp:99: Fehler: invalid use of undefined type »struct FawkesNetworkMessage«
error: src/tools/joystick/joystick_tool.h:31: Fehler: forward declaration of »struct FawkesNetworkMessage«
error: src/tools/joystick/joystick_tool.cpp:100: Fehler: invalid use of undefined type »struct FawkesNetworkClient«
error: src/tools/joystick/joystick_tool.h:30: Fehler: forward declaration of »struct FawkesNetworkClient«
error: src/tools/joystick/joystick_tool.cpp:101: Fehler: invalid use of undefined type »struct FawkesNetworkMessage«
error: src/tools/joystick/joystick_tool.h:31: Fehler: forward declaration of »struct FawkesNetworkMessage«
error: src/tools/joystick/joystick_tool.cpp:103: Fehler: »MSG_PLUGIN_LIST_LOADED« wurde in diesem Gültigkeitsbereich nicht definiert
error: src/tools/joystick/joystick_tool.cpp:103: Fehler: invalid use of undefined type »struct FawkesNetworkMessage«
error: src/tools/joystick/joystick_tool.h:31: Fehler: forward declaration of »struct FawkesNetworkMessage«
error: src/tools/joystick/joystick_tool.cpp:104: Fehler: invalid use of undefined type »struct FawkesNetworkClient«
error: src/tools/joystick/joystick_tool.h:30: Fehler: forward declaration of »struct FawkesNetworkClient«
error: src/tools/joystick/joystick_tool.cpp:105: Fehler: invalid use of undefined type »struct FawkesNetworkMessage«
error: src/tools/joystick/joystick_tool.h:31: Fehler: forward declaration of »struct FawkesNetworkMessage«
error: src/tools/joystick/joystick_tool.cpp: In destructor »JoystickTool::~JoystickTool()«:
error: src/tools/joystick/joystick_tool.cpp:119: Fehler: »MSG_PLUGIN_UNSUBSCRIBE_WATCH« wurde in diesem Gültigkeitsbereich nicht definiert
error: src/tools/joystick/joystick_tool.cpp:119: Fehler: invalid use of undefined type »struct FawkesNetworkMessage«
error: src/tools/joystick/joystick_tool.h:31: Fehler: forward declaration of »struct FawkesNetworkMessage«
error: src/tools/joystick/joystick_tool.cpp:120: Fehler: invalid use of undefined type »struct FawkesNetworkClient«
error: src/tools/joystick/joystick_tool.h:30: Fehler: forward declaration of »struct FawkesNetworkClient«
error: src/tools/joystick/joystick_tool.cpp:121: Fehler: invalid use of undefined type »struct FawkesNetworkMessage«
error: src/tools/joystick/joystick_tool.h:31: Fehler: forward declaration of »struct FawkesNetworkMessage«
error: src/tools/joystick/joystick_tool.cpp:124: Fehler: invalid use of undefined type »struct FawkesNetworkClient«
error: src/tools/joystick/joystick_tool.h:30: Fehler: forward declaration of »struct FawkesNetworkClient«
error: src/tools/joystick/joystick_tool.cpp: In member function »virtual void JoystickTool::inbound_received(FawkesNetworkMessage*, unsigned int)«:
error: src/tools/joystick/joystick_tool.cpp:159: Fehler: invalid use of undefined type »struct FawkesNetworkMessage«
error: src/tools/joystick/joystick_tool.h:31: Fehler: forward declaration of »struct FawkesNetworkMessage«
error: src/tools/joystick/joystick_tool.cpp:165: Fehler: invalid use of undefined type »struct FawkesNetworkMessage«
error: src/tools/joystick/joystick_tool.h:31: Fehler: forward declaration of »struct FawkesNetworkMessage«
error: src/tools/joystick/joystick_tool.cpp:165: Fehler: »MSG_PLUGIN_UNLOADED« wurde in diesem Gültigkeitsbereich nicht definiert
error: src/tools/joystick/joystick_tool.cpp:167: Fehler: »plugin_unloaded_msg_t« wurde in diesem Gültigkeitsbereich nicht definiert
error: src/tools/joystick/joystick_tool.cpp:167: Fehler: »u« wurde in diesem Gültigkeitsbereich nicht definiert
error: src/tools/joystick/joystick_tool.cpp:167: Fehler: expected primary-expression before »)« token
error: src/tools/joystick/joystick_tool.cpp:167: Fehler: expected `;' before »msg«
error: src/tools/joystick/joystick_tool.cpp:177: Fehler: invalid use of undefined type »struct FawkesNetworkMessage«
error: src/tools/joystick/joystick_tool.h:31: Fehler: forward declaration of »struct FawkesNetworkMessage«
error: src/tools/joystick/joystick_tool.cpp:177: Fehler: »MSG_PLUGIN_LOADED« wurde in diesem Gültigkeitsbereich nicht definiert
error: src/tools/joystick/joystick_tool.cpp:179: Fehler: »plugin_loaded_msg_t« wurde in diesem Gültigkeitsbereich nicht definiert
error: src/tools/joystick/joystick_tool.cpp:179: Fehler: »lm« wurde in diesem Gültigkeitsbereich nicht definiert
error: src/tools/joystick/joystick_tool.cpp:179: Fehler: expected primary-expression before »)« token
error: src/tools/joystick/joystick_tool.cpp:179: Fehler: expected `;' before »msg«
error: src/tools/joystick/joystick_tool.cpp:189: Fehler: invalid use of undefined type »struct FawkesNetworkMessage«
error: src/tools/joystick/joystick_tool.h:31: Fehler: forward declaration of »struct FawkesNetworkMessage«
error: src/tools/joystick/joystick_tool.cpp:190: Fehler: invalid use of undefined type »struct FawkesNetworkClient«
error: src/tools/joystick/joystick_tool.h:30: Fehler: forward declaration of »struct FawkesNetworkClient«
error: src/tools/joystick/joystick_tool.cpp:191: Fehler: invalid use of undefined type »struct FawkesNetworkMessage«
error: src/tools/joystick/joystick_tool.h:31: Fehler: forward declaration of »struct FawkesNetworkMessage«
error: src/tools/joystick/joystick_tool.cpp:194: Fehler: invalid use of undefined type »struct FawkesNetworkMessage«
error: src/tools/joystick/joystick_tool.h:31: Fehler: forward declaration of »struct FawkesNetworkMessage«
error: src/tools/joystick/joystick_tool.cpp:194: Fehler: »MSG_PLUGIN_LOADED_LIST« wurde in diesem Gültigkeitsbereich nicht definiert
error: src/tools/joystick/joystick_tool.cpp:196: Fehler: »PluginListMessage« wurde in diesem Gültigkeitsbereich nicht definiert
error: src/tools/joystick/joystick_tool.cpp:196: Fehler: »plm« wurde in diesem Gültigkeitsbereich nicht definiert
error: src/tools/joystick/joystick_tool.cpp:196: Fehler: invalid use of undefined type »struct FawkesNetworkMessage«
error: src/tools/joystick/joystick_tool.h:31: Fehler: forward declaration of »struct FawkesNetworkMessage«
error: src/tools/joystick/joystick_tool.cpp:196: Fehler: expected primary-expression before »)« token
error: src/tools/joystick/joystick_tool.cpp:211: Fehler: invalid use of undefined type »struct FawkesNetworkMessage«
error: src/tools/joystick/joystick_tool.h:31: Fehler: forward declaration of »struct FawkesNetworkMessage«
error: src/tools/joystick/joystick_tool.cpp:212: Fehler: invalid use of undefined type »struct FawkesNetworkClient«
error: src/tools/joystick/joystick_tool.h:30: Fehler: forward declaration of »struct FawkesNetworkClient«
error: src/tools/joystick/joystick_tool.cpp:213: Fehler: invalid use of undefined type »struct FawkesNetworkMessage«
error: src/tools/joystick/joystick_tool.h:31: Fehler: forward declaration of »struct FawkesNetworkMessage«
error: src/tools/joystick/joystick_tool.cpp:222: Fehler: Argument vom Typ »&lt;type error&gt;« wurde an »delete« übergeben, Zeiger erwartet
error: src/tools/joystick/joystick_tool.cpp: In member function »void JoystickTool::mainLoop()«:
error: src/tools/joystick/joystick_tool.cpp:307: Fehler: »cred« ist kein Element von »std«
error: src/tools/joystick/joystick_tool.cpp:311: Fehler: »cnormal« ist kein Element von »std«
error: src/tools/joystick/joystick_tool.cpp:316: Fehler: invalid use of undefined type »struct FawkesNetworkMessage«
error: src/tools/joystick/joystick_tool.h:31: Fehler: forward declaration of »struct FawkesNetworkMessage«
error: src/tools/joystick/joystick_tool.cpp:317: Fehler: invalid use of undefined type »struct FawkesNetworkClient«
error: src/tools/joystick/joystick_tool.h:30: Fehler: forward declaration of »struct FawkesNetworkClient«
error: src/tools/joystick/joystick_tool.cpp:318: Fehler: invalid use of undefined type »struct FawkesNetworkMessage«
error: src/tools/joystick/joystick_tool.h:31: Fehler: forward declaration of »struct FawkesNetworkMessage«
error: src/tools/joystick/joystick_tool.cpp:322: Fehler: expected type-specifier before »Exception«
error: src/tools/joystick/joystick_tool.cpp:322: Fehler: expected `)' before »&amp;« token
error: src/tools/joystick/joystick_tool.cpp:322: Fehler: expected `{' before »&amp;« token
error: src/tools/joystick/joystick_tool.cpp:322: Fehler: »e« wurde in diesem Gültigkeitsbereich nicht definiert
error: src/tools/joystick/joystick_tool.cpp:322: Fehler: expected `;' before »)« token
error: src/tools/joystick/joystick_tool.cpp:338: Fehler: »cred« ist kein Element von »std«
error: src/tools/joystick/joystick_tool.cpp:338: Fehler: »cnormal« ist kein Element von »std«
error: src/tools/joystick/joystick_tool.cpp:342: Fehler: invalid use of undefined type »struct FawkesNetworkMessage«
error: src/tools/joystick/joystick_tool.h:31: Fehler: forward declaration of »struct FawkesNetworkMessage«
error: src/tools/joystick/joystick_tool.cpp:344: Fehler: invalid use of undefined type »struct FawkesNetworkClient«
error: src/tools/joystick/joystick_tool.h:30: Fehler: forward declaration of »struct FawkesNetworkClient«
error: src/tools/joystick/joystick_tool.cpp:345: Fehler: invalid use of undefined type »struct FawkesNetworkMessage«
error: src/tools/joystick/joystick_tool.h:31: Fehler: forward declaration of »struct FawkesNetworkMessage«
error: src/tools/joystick/joystick_tool.cpp:354: Fehler: expected type-specifier before »Exception«
error: src/tools/joystick/joystick_tool.cpp:354: Fehler: expected `)' before »&amp;« token
error: src/tools/joystick/joystick_tool.cpp:354: Fehler: expected `{' before »&amp;« token
error: src/tools/joystick/joystick_tool.cpp:354: Fehler: »e« wurde in diesem Gültigkeitsbereich nicht definiert
error: src/tools/joystick/joystick_tool.cpp:354: Fehler: expected `;' before »)« token
error: src/tools/joystick/joystick_tool.cpp: In function »int main(int, char**)«:
error: src/tools/joystick/joystick_tool.cpp:364: Fehler: »ArgumentParser« wurde in diesem Gültigkeitsbereich nicht definiert
error: src/tools/joystick/joystick_tool.cpp:364: Fehler: »argp« wurde in diesem Gültigkeitsbereich nicht definiert
error: src/tools/joystick/joystick_tool.cpp:364: Fehler: expected type-specifier before »ArgumentParser«
error: src/tools/joystick/joystick_tool.cpp:364: Fehler: expected `;' before »ArgumentParser«
error: make[4]: *** [joystick_tool.o] Fehler 1
error: make[3]: *** [.objs] Fehler 2
error: make[2]: *** [joystick] Fehler 2
error: make[1]: *** [tools] Fehler 2
error: make: *** [src] Fehler 2 info: make: Entering directory `'
 info: --&gt; Entering sub-directory src ---
 info:    --&gt; Entering sub-directory libs ---
 info:       --&gt; Entering sub-directory core ---
 info: make[4]: Für das Ziel »uncolored-gui« ist nichts zu tun.
 info:          &lt;-- Leaving core
 info:       --&gt; Entering sub-directory utils ---
 info: make[4]: Für das Ziel »uncolored-gui« ist nichts zu tun.
 info:          &lt;-- Leaving utils
 info:       --&gt; Entering sub-directory interface ---
 info: make[4]: Für das Ziel »uncolored-gui« ist nichts zu tun.
 info:          &lt;-- Leaving interface
 info:       --&gt; Entering sub-directory netcomm ---
 info: make[4]: Für das Ziel »uncolored-gui« ist nichts zu tun.
 info:          &lt;-- Leaving netcomm
 info:       --&gt; Entering sub-directory blackboard ---
 info: make[4]: Für das Ziel »uncolored-gui« ist nichts zu tun.
 info:          &lt;-- Leaving blackboard
 info:       --&gt; Entering sub-directory config ---
 info: make[4]: Für das Ziel »uncolored-gui« ist nichts zu tun.
 info:          &lt;-- Leaving config
 info:       --&gt; Entering sub-directory aspect ---
 info: make[4]: Für das Ziel »uncolored-gui« ist nichts zu tun.
 info:          &lt;-- Leaving aspect
 info:       --&gt; Entering sub-directory geometry ---
 info: make[4]: Für das Ziel »uncolored-gui« ist nichts zu tun.
 info:          &lt;-- Leaving geometry
 info:       --&gt; Entering sub-directory worldinfo_utils ---
 info: make[4]: Für das Ziel »uncolored-gui« ist nichts zu tun.
 info:          &lt;-- Leaving worldinfo_utils
 info:       &lt;-- Leaving libs
 info:    --&gt; Entering sub-directory interfaces ---
 info: make[3]: Für das Ziel »uncolored-gui« ist nichts zu tun.
 info:       &lt;-- Leaving interfaces
 info:    --&gt; Entering sub-directory mainapp ---
 info: make[3]: Für das Ziel »uncolored-gui« ist nichts zu tun.
 info:       &lt;-- Leaving mainapp
 info:    --&gt; Entering sub-directory firevision ---
 info:       --&gt; Entering sub-directory fvutils ---
 info: make[4]: Für das Ziel »uncolored-gui« ist nichts zu tun.
 info:          &lt;-- Leaving fvutils
 info:       --&gt; Entering sub-directory cams ---
 info: make[4]: Für das Ziel »uncolored-gui« ist nichts zu tun.
 info:          &lt;-- Leaving cams
 info:       --&gt; Entering sub-directory classifiers ---
 info: make[4]: Für das Ziel »uncolored-gui« ist nichts zu tun.
 info:          &lt;-- Leaving classifiers
 info:       --&gt; Entering sub-directory models ---
 info: make[4]: Für das Ziel »uncolored-gui« ist nichts zu tun.
 info:          &lt;-- Leaving models
 info:       --&gt; Entering sub-directory filters ---
 info: make[4]: Für das Ziel »uncolored-gui« ist nichts zu tun.
 info:          &lt;-- Leaving filters
 info:       --&gt; Entering sub-directory stereo ---
 info: make[4]: Für das Ziel »uncolored-gui« ist nichts zu tun.
 info:          &lt;-- Leaving stereo
 info:       --&gt; Entering sub-directory fvwidgets ---
 info: make[4]: Für das Ziel »uncolored-gui« ist nichts zu tun.
 info:          &lt;-- Leaving fvwidgets
 info:       --&gt; Entering sub-directory apps ---
 info:          --&gt; Entering sub-directory base ---
 info: make[5]: Für das Ziel »uncolored-gui« ist nichts zu tun.
 info:             &lt;-- Leaving base
 info:          --&gt; Entering sub-directory fountain ---
 info: make[5]: Für das Ziel »uncolored-gui« ist nichts zu tun.
 info:             &lt;-- Leaving fountain
 info:          --&gt; Entering sub-directory retriever ---
 info: make[5]: Für das Ziel »uncolored-gui« ist nichts zu tun.
 info:             &lt;-- Leaving retriever
 info:          --&gt; Entering sub-directory omni_ball ---
 info: make[5]: Für das Ziel »uncolored-gui« ist nichts zu tun.
 info:             &lt;-- Leaving omni_ball
 info:          --&gt; Entering sub-directory omni_field ---
 info: make[5]: Für das Ziel »uncolored-gui« ist nichts zu tun.
 info:             &lt;-- Leaving omni_field
 info:          --&gt; Entering sub-directory omni_localizer ---
 info: make[5]: Für das Ziel »uncolored-gui« ist nichts zu tun.
 info:             &lt;-- Leaving omni_localizer
 info:          &lt;-- Leaving apps
 info:       --&gt; Entering sub-directory tools ---
 info:          --- Compiling viewer.cpp (C++)
 info:          === Linking fvviewer ---
 info:          --- Compiling show_yuv.cpp (C++)
 info:          === Linking fvshowyuv ---
 info:          --&gt; Entering sub-directory firestation ---
 info:             --- Compiling color_train_widget.cpp (C++)
 info:             --- Compiling mirror_calib.cpp (C++)
 info:             --- Compiling fuse_transfer_widget.cpp (C++)
 info:             --- Compiling fuse_image_list_widget.cpp (C++)
 info:             --- Compiling colormap_viewer_widget.cpp (C++)
 info:             --- Compiling firestation.cpp (C++)
 info:             --- Compiling main.cpp (C++)
 info:             === Linking firestation ---
 info:             &lt;-- Leaving firestation
 info:          &lt;-- Leaving tools
 info:       &lt;-- Leaving firevision
 info:    --&gt; Entering sub-directory plugins ---
 info:       --&gt; Entering sub-directory battery ---
 info: make[4]: Für das Ziel »uncolored-gui« ist nichts zu tun.
 info:          &lt;-- Leaving battery
 info:       --&gt; Entering sub-directory kicker ---
 info: make[4]: Für das Ziel »uncolored-gui« ist nichts zu tun.
 info:          &lt;-- Leaving kicker
 info:       --&gt; Entering sub-directory navigator ---
 info:          --&gt; Entering sub-directory gts ---
 info: make[6]: Für das Ziel »uncolored-gui« ist nichts zu tun.
 info:             &lt;-- Leaving gts
 info:          --&gt; Entering sub-directory fuzzy ---
 info: make[6]: Für das Ziel »uncolored-gui« ist nichts zu tun.
 info:             &lt;-- Leaving fuzzy
 info:          --&gt; Entering sub-directory libnavi ---
 info: make[6]: Für das Ziel »uncolored-gui« ist nichts zu tun.
 info:             &lt;-- Leaving libnavi
 info:          --&gt; Entering sub-directory robot_motion ---
 info: make[6]: Für das Ziel »uncolored-gui« ist nichts zu tun.
 info:             &lt;-- Leaving robot_motion
 info:          &lt;-- Leaving navigator
 info:       --&gt; Entering sub-directory worldmodel ---
 info: make[4]: Für das Ziel »uncolored-gui« ist nichts zu tun.
 info:          &lt;-- Leaving worldmodel
 info:       --&gt; Entering sub-directory skiller ---
 info:          --&gt; Entering sub-directory consoletool ---
 info: make[6]: Für das Ziel »uncolored-gui« ist nichts zu tun.
 info:             &lt;-- Leaving consoletool
 info:          &lt;-- Leaving skiller
 info:       &lt;-- Leaving plugins
 info:    --&gt; Entering sub-directory tools ---
 info:       --&gt; Entering sub-directory blackboard ---
 info: make[4]: Für das Ziel »uncolored-gui« ist nichts zu tun.
 info:          &lt;-- Leaving blackboard
 info:       --&gt; Entering sub-directory plugin ---
 info: make[4]: Für das Ziel »uncolored-gui« ist nichts zu tun.
 info:          &lt;-- Leaving plugin
 info:       --&gt; Entering sub-directory logview ---
 info: make[4]: Für das Ziel »uncolored-gui« ist nichts zu tun.
 info:          &lt;-- Leaving logview
 info:       --&gt; Entering sub-directory config ---
 info: make[4]: Für das Ziel »uncolored-gui« ist nichts zu tun.
 info:          &lt;-- Leaving config
 info:       --&gt; Entering sub-directory joystick ---
 info: make[4]: Für das Ziel »uncolored-gui« ist nichts zu tun.
 info:          &lt;-- Leaving joystick
 info:       --&gt; Entering sub-directory plugin_gui ---
 info:          --- Compiling main.cpp (C++)
 info:          --- Compiling plugin_gui.cpp (C++)
 info:          --- Compiling backend_thread.cpp (C++)
 info:          === Linking pt_gui ---
 info:          &lt;-- Leaving plugin_gui
 info:       --&gt; Entering sub-directory navigator_gui ---
 info:          --- Compiling navigator_gui.cpp (C++)
error: src/tools/navigator_gui/navigator_gui.h:70: Fehler: expected class-name before »{« token
error: src/tools/navigator_gui/navigator_gui.h:186: Fehler: ISO-C++ verbietet Deklaration von »LockList« ohne Typ
error: src/tools/navigator_gui/navigator_gui.h:186: Fehler: expected »;« before »&lt;« token
error: src/tools/navigator_gui/navigator_gui.h:187: Fehler: ISO-C++ verbietet Deklaration von »LockList« ohne Typ
error: src/tools/navigator_gui/navigator_gui.h:187: Fehler: expected »;« before »&lt;« token
error: src/tools/navigator_gui/navigator_gui.h:188: Fehler: ISO-C++ verbietet Deklaration von »LockList« ohne Typ
error: src/tools/navigator_gui/navigator_gui.h:188: Fehler: expected »;« before »&lt;« token
 info: make: Leaving directory `'
error: src/tools/navigator_gui/navigator_gui.h:189: Fehler: ISO-C++ verbietet Deklaration von »LockList« ohne Typ
error: src/tools/navigator_gui/navigator_gui.h:189: Fehler: expected »;« before »&lt;« token
error: src/tools/navigator_gui/navigator_gui.cpp: In constructor »NavigatorGUI::NavigatorGUI(const char*)«:
error: src/tools/navigator_gui/navigator_gui.cpp:319: Fehler: invalid use of undefined type »struct Mutex«
error: src/tools/navigator_gui/navigator_gui.h:40: Fehler: forward declaration of »struct Mutex«
error: src/tools/navigator_gui/navigator_gui.cpp:320: Fehler: invalid use of undefined type »struct Mutex«
error: src/tools/navigator_gui/navigator_gui.h:40: Fehler: forward declaration of »struct Mutex«
error: src/tools/navigator_gui/navigator_gui.cpp:321: Fehler: invalid use of undefined type »struct Mutex«
error: src/tools/navigator_gui/navigator_gui.h:40: Fehler: forward declaration of »struct Mutex«
error: src/tools/navigator_gui/navigator_gui.cpp:322: Fehler: invalid use of undefined type »struct Mutex«
error: src/tools/navigator_gui/navigator_gui.h:40: Fehler: forward declaration of »struct Mutex«
error: src/tools/navigator_gui/navigator_gui.cpp:323: Fehler: invalid use of undefined type »struct Mutex«
error: src/tools/navigator_gui/navigator_gui.h:40: Fehler: forward declaration of »struct Mutex«
error: src/tools/navigator_gui/navigator_gui.cpp: In destructor »virtual NavigatorGUI::~NavigatorGUI()«:
error: src/tools/navigator_gui/navigator_gui.cpp:373: Fehler: invalid use of undefined type »struct FawkesNetworkClient«
error: src/tools/navigator_gui/navigator_gui.h:37: Fehler: forward declaration of »struct FawkesNetworkClient«
error: src/tools/navigator_gui/navigator_gui.cpp:375: Fehler: invalid use of undefined type »struct FawkesNetworkClient«
error: src/tools/navigator_gui/navigator_gui.h:37: Fehler: forward declaration of »struct FawkesNetworkClient«
error: src/tools/navigator_gui/navigator_gui.cpp:377: Fehler: invalid use of undefined type »struct FawkesNetworkClient«
error: src/tools/navigator_gui/navigator_gui.h:37: Fehler: forward declaration of »struct FawkesNetworkClient«
error: cc1plus: warnings being treated as errors
error: src/tools/navigator_gui/navigator_gui.cpp:379: Warnung: mögliches Problem bei Aufruf des »delete«-Operators erkannt
error: src/tools/navigator_gui/navigator_gui.cpp:379: Warnung: invalid use of undefined type »struct FawkesNetworkClient«
error: src/tools/navigator_gui/navigator_gui.h:37: Warnung: forward declaration of »struct FawkesNetworkClient«
error: src/tools/navigator_gui/navigator_gui.cpp:379: Anmerkung: weder der Destruktor noch der klassenspezifische Operator »delete« wird aufgerufen, auch wenn sie bei der Klassendefinition deklariert werden
error: src/tools/navigator_gui/navigator_gui.cpp:384: Fehler: »lines« wurde in diesem Gültigkeitsbereich nicht definiert
error: src/tools/navigator_gui/navigator_gui.cpp:385: Fehler: »LockList« wurde in diesem Gültigkeitsbereich nicht definiert
error: src/tools/navigator_gui/navigator_gui.cpp:385: Fehler: expected primary-expression before »*« token
error: src/tools/navigator_gui/navigator_gui.cpp:385: Fehler: expected primary-expression before »&gt;« token
error: src/tools/navigator_gui/navigator_gui.cpp:385: Fehler: »::iterator« wurde nicht deklariert
error: src/tools/navigator_gui/navigator_gui.cpp:385: Fehler: expected `;' before »iterator«
error: src/tools/navigator_gui/navigator_gui.cpp:386: Fehler: »iterator« wurde in diesem Gültigkeitsbereich nicht definiert
error: src/tools/navigator_gui/navigator_gui.cpp:395: Fehler: »points« wurde in diesem Gültigkeitsbereich nicht definiert
error: src/tools/navigator_gui/navigator_gui.cpp:396: Fehler: expected primary-expression before »*« token
error: src/tools/navigator_gui/navigator_gui.cpp:396: Fehler: expected primary-expression before »&gt;« token
error: src/tools/navigator_gui/navigator_gui.cpp:396: Fehler: »::iterator« wurde nicht deklariert
error: src/tools/navigator_gui/navigator_gui.cpp:396: Fehler: expected `;' before »iterator«
error: src/tools/navigator_gui/navigator_gui.cpp:397: Fehler: »iterator« wurde in diesem Gültigkeitsbereich nicht definiert
error: src/tools/navigator_gui/navigator_gui.cpp:405: Fehler: »path_points« wurde in diesem Gültigkeitsbereich nicht definiert
error: src/tools/navigator_gui/navigator_gui.cpp:406: Fehler: expected primary-expression before »*« token
error: src/tools/navigator_gui/navigator_gui.cpp:406: Fehler: expected primary-expression before »&gt;« token
error: src/tools/navigator_gui/navigator_gui.cpp:406: Fehler: »::iterator« wurde nicht deklariert
error: src/tools/navigator_gui/navigator_gui.cpp:406: Fehler: expected `;' before »iterator«
error: src/tools/navigator_gui/navigator_gui.cpp:407: Fehler: »iterator« wurde in diesem Gültigkeitsbereich nicht definiert
error: src/tools/navigator_gui/navigator_gui.cpp:414: Warnung: mögliches Problem bei Aufruf des »delete«-Operators erkannt
error: src/tools/navigator_gui/navigator_gui.cpp:414: Warnung: invalid use of undefined type »struct Mutex«
error: src/tools/navigator_gui/navigator_gui.h:40: Warnung: forward declaration of »struct Mutex«
error: src/tools/navigator_gui/navigator_gui.cpp:414: Anmerkung: weder der Destruktor noch der klassenspezifische Operator »delete« wird aufgerufen, auch wenn sie bei der Klassendefinition deklariert werden
error: src/tools/navigator_gui/navigator_gui.cpp:415: Warnung: mögliches Problem bei Aufruf des »delete«-Operators erkannt
error: src/tools/navigator_gui/navigator_gui.cpp:415: Warnung: invalid use of undefined type »struct Mutex«
error: src/tools/navigator_gui/navigator_gui.h:40: Warnung: forward declaration of »struct Mutex«
error: src/tools/navigator_gui/navigator_gui.cpp:415: Anmerkung: weder der Destruktor noch der klassenspezifische Operator »delete« wird aufgerufen, auch wenn sie bei der Klassendefinition deklariert werden
error: src/tools/navigator_gui/navigator_gui.cpp:416: Warnung: mögliches Problem bei Aufruf des »delete«-Operators erkannt
error: src/tools/navigator_gui/navigator_gui.cpp:416: Warnung: invalid use of undefined type »struct Mutex«
error: src/tools/navigator_gui/navigator_gui.h:40: Warnung: forward declaration of »struct Mutex«
error: src/tools/navigator_gui/navigator_gui.cpp:416: Anmerkung: weder der Destruktor noch der klassenspezifische Operator »delete« wird aufgerufen, auch wenn sie bei der Klassendefinition deklariert werden
error: src/tools/navigator_gui/navigator_gui.cpp:417: Warnung: mögliches Problem bei Aufruf des »delete«-Operators erkannt
error: src/tools/navigator_gui/navigator_gui.cpp:417: Warnung: invalid use of undefined type »struct Mutex«
error: src/tools/navigator_gui/navigator_gui.h:40: Warnung: forward declaration of »struct Mutex«
error: src/tools/navigator_gui/navigator_gui.cpp:417: Anmerkung: weder der Destruktor noch der klassenspezifische Operator »delete« wird aufgerufen, auch wenn sie bei der Klassendefinition deklariert werden
error: src/tools/navigator_gui/navigator_gui.cpp:418: Warnung: mögliches Problem bei Aufruf des »delete«-Operators erkannt
error: src/tools/navigator_gui/navigator_gui.cpp:418: Warnung: invalid use of undefined type »struct Mutex«
error: src/tools/navigator_gui/navigator_gui.h:40: Warnung: forward declaration of »struct Mutex«
error: src/tools/navigator_gui/navigator_gui.cpp:418: Anmerkung: weder der Destruktor noch der klassenspezifische Operator »delete« wird aufgerufen, auch wenn sie bei der Klassendefinition deklariert werden
error: src/tools/navigator_gui/navigator_gui.cpp: In member function »void NavigatorGUI::connect()«:
error: src/tools/navigator_gui/navigator_gui.cpp:430: Fehler: invalid use of undefined type »struct FawkesNetworkClient«
error: src/tools/navigator_gui/navigator_gui.h:37: Fehler: forward declaration of »struct FawkesNetworkClient«
error: src/tools/navigator_gui/navigator_gui.cpp:431: Fehler: invalid use of undefined type »struct FawkesNetworkClient«
error: src/tools/navigator_gui/navigator_gui.h:37: Fehler: forward declaration of »struct FawkesNetworkClient«
error: src/tools/navigator_gui/navigator_gui.cpp:432: Fehler: invalid use of undefined type »struct FawkesNetworkClient«
error: src/tools/navigator_gui/navigator_gui.h:37: Fehler: forward declaration of »struct FawkesNetworkClient«
error: src/tools/navigator_gui/navigator_gui.cpp:438: Warnung: mögliches Problem bei Aufruf des »delete«-Operators erkannt
error: src/tools/navigator_gui/navigator_gui.cpp:438: Warnung: invalid use of undefined type »struct FawkesNetworkClient«
error: src/tools/navigator_gui/navigator_gui.h:37: Warnung: forward declaration of »struct FawkesNetworkClient«
error: src/tools/navigator_gui/navigator_gui.cpp:438: Anmerkung: weder der Destruktor noch der klassenspezifische Operator »delete« wird aufgerufen, auch wenn sie bei der Klassendefinition deklariert werden
error: src/tools/navigator_gui/navigator_gui.cpp:440: Fehler: invalid use of undefined type »struct FawkesNetworkClient«
error: src/tools/navigator_gui/navigator_gui.h:37: Fehler: forward declaration of »struct FawkesNetworkClient«
error: src/tools/navigator_gui/navigator_gui.cpp:442: Fehler: invalid use of undefined type »struct FawkesNetworkClient«
error: src/tools/navigator_gui/navigator_gui.h:37: Fehler: forward declaration of »struct FawkesNetworkClient«
error: src/tools/navigator_gui/navigator_gui.cpp:443: Fehler: invalid use of undefined type »struct FawkesNetworkClient«
error: src/tools/navigator_gui/navigator_gui.h:37: Fehler: forward declaration of »struct FawkesNetworkClient«
error: src/tools/navigator_gui/navigator_gui.cpp:447: Fehler: invalid use of undefined type »struct FawkesNetworkClient«
error: src/tools/navigator_gui/navigator_gui.h:37: Fehler: forward declaration of »struct FawkesNetworkClient«
error: src/tools/navigator_gui/navigator_gui.cpp:451: Fehler: »MSG_PLUGIN_SUBSCRIBE_WATCH« wurde in diesem Gültigkeitsbereich nicht definiert
error: src/tools/navigator_gui/navigator_gui.cpp:451: Fehler: invalid use of undefined type »struct FawkesNetworkMessage«
error: src/tools/navigator_gui/navigator_gui.h:38: Fehler: forward declaration of »struct FawkesNetworkMessage«
error: src/tools/navigator_gui/navigator_gui.cpp:452: Fehler: invalid use of undefined type »struct FawkesNetworkClient«
error: src/tools/navigator_gui/navigator_gui.h:37: Fehler: forward declaration of »struct FawkesNetworkClient«
error: src/tools/navigator_gui/navigator_gui.cpp:453: Fehler: invalid use of undefined type »struct FawkesNetworkMessage«
error: src/tools/navigator_gui/navigator_gui.h:38: Fehler: forward declaration of »struct FawkesNetworkMessage«
error: src/tools/navigator_gui/navigator_gui.cpp:455: Fehler: »MSG_PLUGIN_LIST_LOADED« wurde in diesem Gültigkeitsbereich nicht definiert
error: src/tools/navigator_gui/navigator_gui.cpp:455: Fehler: invalid use of undefined type »struct FawkesNetworkMessage«
error: src/tools/navigator_gui/navigator_gui.h:38: Fehler: forward declaration of »struct FawkesNetworkMessage«
error: src/tools/navigator_gui/navigator_gui.cpp:456: Fehler: invalid use of undefined type »struct FawkesNetworkClient«
error: src/tools/navigator_gui/navigator_gui.h:37: Fehler: forward declaration of »struct FawkesNetworkClient«
error: src/tools/navigator_gui/navigator_gui.cpp:457: Fehler: invalid use of undefined type »struct FawkesNetworkMessage«
error: src/tools/navigator_gui/navigator_gui.h:38: Fehler: forward declaration of »struct FawkesNetworkMessage«
error: src/tools/navigator_gui/navigator_gui.cpp:464: Fehler: expected type-specifier before »SocketException«
error: src/tools/navigator_gui/navigator_gui.cpp:464: Fehler: expected `)' before »&amp;« token
error: src/tools/navigator_gui/navigator_gui.cpp:464: Fehler: expected `{' before »&amp;« token
error: src/tools/navigator_gui/navigator_gui.cpp:464: Fehler: »e« wurde in diesem Gültigkeitsbereich nicht definiert
error: src/tools/navigator_gui/navigator_gui.cpp:464: Fehler: expected `;' before »)« token
error: src/tools/navigator_gui/navigator_gui.cpp: In member function »void NavigatorGUI::reset_gui()«:
error: src/tools/navigator_gui/navigator_gui.cpp:526: Fehler: »lines« wurde in diesem Gültigkeitsbereich nicht definiert
error: src/tools/navigator_gui/navigator_gui.cpp:527: Fehler: »LockList« wurde in diesem Gültigkeitsbereich nicht definiert
error: src/tools/navigator_gui/navigator_gui.cpp:527: Fehler: expected primary-expression before »*« token
error: src/tools/navigator_gui/navigator_gui.cpp:527: Fehler: expected primary-expression before »&gt;« token
error: src/tools/navigator_gui/navigator_gui.cpp:527: Fehler: »::iterator« wurde nicht deklariert
error: src/tools/navigator_gui/navigator_gui.cpp:527: Fehler: expected `;' before »iterator«
error: src/tools/navigator_gui/navigator_gui.cpp:528: Fehler: »iterator« wurde in diesem Gültigkeitsbereich nicht definiert
error: src/tools/navigator_gui/navigator_gui.cpp:536: Fehler: »points« wurde in diesem Gültigkeitsbereich nicht definiert
error: src/tools/navigator_gui/navigator_gui.cpp:537: Fehler: expected primary-expression before »*« token
error: src/tools/navigator_gui/navigator_gui.cpp:537: Fehler: expected primary-expression before »&gt;« token
error: src/tools/navigator_gui/navigator_gui.cpp:537: Fehler: »::iterator« wurde nicht deklariert
error: src/tools/navigator_gui/navigator_gui.cpp:537: Fehler: expected `;' before »iterator«
error: src/tools/navigator_gui/navigator_gui.cpp:538: Fehler: »iterator« wurde in diesem Gültigkeitsbereich nicht definiert
error: src/tools/navigator_gui/navigator_gui.cpp:546: Fehler: »path_points« wurde in diesem Gültigkeitsbereich nicht definiert
error: src/tools/navigator_gui/navigator_gui.cpp:547: Fehler: expected primary-expression before »*« token
error: src/tools/navigator_gui/navigator_gui.cpp:547: Fehler: expected primary-expression before »&gt;« token
error: src/tools/navigator_gui/navigator_gui.cpp:547: Fehler: »::iterator« wurde nicht deklariert
error: src/tools/navigator_gui/navigator_gui.cpp:547: Fehler: expected `;' before »iterator«
error: src/tools/navigator_gui/navigator_gui.cpp:548: Fehler: »iterator« wurde in diesem Gültigkeitsbereich nicht definiert
error: src/tools/navigator_gui/navigator_gui.cpp:556: Fehler: »obstacles« wurde in diesem Gültigkeitsbereich nicht definiert
error: src/tools/navigator_gui/navigator_gui.cpp:557: Fehler: expected primary-expression before »*« token
error: src/tools/navigator_gui/navigator_gui.cpp:557: Fehler: expected primary-expression before »&gt;« token
error: src/tools/navigator_gui/navigator_gui.cpp:557: Fehler: »::iterator« wurde nicht deklariert
error: src/tools/navigator_gui/navigator_gui.cpp:557: Fehler: expected `;' before »iterator«
error: src/tools/navigator_gui/navigator_gui.cpp:558: Fehler: »iterator« wurde in diesem Gültigkeitsbereich nicht definiert
error: src/tools/navigator_gui/navigator_gui.cpp: In member function »void NavigatorGUI::inbound_received(FawkesNetworkMessage*, unsigned int)«:
error: src/tools/navigator_gui/navigator_gui.cpp:576: Fehler: invalid use of undefined type »struct FawkesNetworkMessage«
error: src/tools/navigator_gui/navigator_gui.h:38: Fehler: forward declaration of »struct FawkesNetworkMessage«
error: src/tools/navigator_gui/navigator_gui.cpp:580: Fehler: invalid use of undefined type »struct FawkesNetworkMessage«
error: src/tools/navigator_gui/navigator_gui.h:38: Fehler: forward declaration of »struct FawkesNetworkMessage«
error: src/tools/navigator_gui/navigator_gui.cpp: In member function »void NavigatorGUI::process_navigator_message(FawkesNetworkMessage*)«:
error: src/tools/navigator_gui/navigator_gui.cpp:591: Fehler: invalid use of undefined type »struct FawkesNetworkMessage«
error: src/tools/navigator_gui/navigator_gui.h:38: Fehler: forward declaration of »struct FawkesNetworkMessage«
error: src/tools/navigator_gui/navigator_gui.cpp:599: Fehler: invalid use of undefined type »struct FawkesNetworkMessage«
error: src/tools/navigator_gui/navigator_gui.h:38: Fehler: forward declaration of »struct FawkesNetworkMessage«
error: src/tools/navigator_gui/navigator_gui.cpp:601: Fehler: invalid use of undefined type »struct FawkesNetworkMessage«
error: src/tools/navigator_gui/navigator_gui.h:38: Fehler: forward declaration of »struct FawkesNetworkMessage«
error: src/tools/navigator_gui/navigator_gui.cpp:601: Fehler: expected primary-expression before »&gt;« token
error: src/tools/navigator_gui/navigator_gui.cpp:601: Fehler: expected primary-expression before »)« token
error: src/tools/navigator_gui/navigator_gui.cpp:604: Fehler: »lines« wurde in diesem Gültigkeitsbereich nicht definiert
error: src/tools/navigator_gui/navigator_gui.cpp:605: Fehler: »LockList« wurde in diesem Gültigkeitsbereich nicht definiert
error: src/tools/navigator_gui/navigator_gui.cpp:605: Fehler: expected primary-expression before »*« token
error: src/tools/navigator_gui/navigator_gui.cpp:605: Fehler: expected primary-expression before »&gt;« token
error: src/tools/navigator_gui/navigator_gui.cpp:605: Fehler: »::iterator« wurde nicht deklariert
error: src/tools/navigator_gui/navigator_gui.cpp:605: Fehler: expected `;' before »iterator«
error: src/tools/navigator_gui/navigator_gui.cpp:606: Fehler: »iterator« wurde in diesem Gültigkeitsbereich nicht definiert
error: src/tools/navigator_gui/navigator_gui.cpp:626: Fehler: invalid use of undefined type »struct FawkesNetworkMessage«
error: src/tools/navigator_gui/navigator_gui.h:38: Fehler: forward declaration of »struct FawkesNetworkMessage«
error: src/tools/navigator_gui/navigator_gui.cpp:628: Fehler: invalid use of undefined type »struct FawkesNetworkMessage«
error: src/tools/navigator_gui/navigator_gui.h:38: Fehler: forward declaration of »struct FawkesNetworkMessage«
error: src/tools/navigator_gui/navigator_gui.cpp:628: Fehler: expected primary-expression before »&gt;« token
error: src/tools/navigator_gui/navigator_gui.cpp:628: Fehler: expected primary-expression before »)« token
error: src/tools/navigator_gui/navigator_gui.cpp:631: Fehler: »obstacles« wurde in diesem Gültigkeitsbereich nicht definiert
error: src/tools/navigator_gui/navigator_gui.cpp:632: Fehler: »LockList« wurde in diesem Gültigkeitsbereich nicht definiert
error: src/tools/navigator_gui/navigator_gui.cpp:632: Fehler: expected primary-expression before »*« token
error: src/tools/navigator_gui/navigator_gui.cpp:632: Fehler: expected primary-expression before »&gt;« token
error: src/tools/navigator_gui/navigator_gui.cpp:632: Fehler: »::iterator« wurde nicht deklariert
error: src/tools/navigator_gui/navigator_gui.cpp:632: Fehler: expected `;' before »iterator«
error: src/tools/navigator_gui/navigator_gui.cpp:633: Fehler: »iterator« wurde in diesem Gültigkeitsbereich nicht definiert
error: src/tools/navigator_gui/navigator_gui.cpp:649: Fehler: invalid use of undefined type »struct FawkesNetworkMessage«
error: src/tools/navigator_gui/navigator_gui.h:38: Fehler: forward declaration of »struct FawkesNetworkMessage«
error: src/tools/navigator_gui/navigator_gui.cpp:651: Fehler: invalid use of undefined type »struct FawkesNetworkMessage«
error: src/tools/navigator_gui/navigator_gui.h:38: Fehler: forward declaration of »struct FawkesNetworkMessage«
error: src/tools/navigator_gui/navigator_gui.cpp:651: Fehler: expected primary-expression before »&gt;« token
error: src/tools/navigator_gui/navigator_gui.cpp:651: Fehler: expected primary-expression before »)« token
error: src/tools/navigator_gui/navigator_gui.cpp:654: Fehler: »path_points« wurde in diesem Gültigkeitsbereich nicht definiert
error: src/tools/navigator_gui/navigator_gui.cpp:655: Fehler: »LockList« wurde in diesem Gültigkeitsbereich nicht definiert
error: src/tools/navigator_gui/navigator_gui.cpp:655: Fehler: expected primary-expression before »*« token
error: src/tools/navigator_gui/navigator_gui.cpp:655: Fehler: expected primary-expression before »&gt;« token
error: src/tools/navigator_gui/navigator_gui.cpp:655: Fehler: »::iterator« wurde nicht deklariert
error: src/tools/navigator_gui/navigator_gui.cpp:655: Fehler: expected `;' before »iterator«
error: src/tools/navigator_gui/navigator_gui.cpp:656: Fehler: »iterator« wurde in diesem Gültigkeitsbereich nicht definiert
error: src/tools/navigator_gui/navigator_gui.cpp:673: Fehler: invalid use of undefined type »struct FawkesNetworkMessage«
error: src/tools/navigator_gui/navigator_gui.h:38: Fehler: forward declaration of »struct FawkesNetworkMessage«
error: src/tools/navigator_gui/navigator_gui.cpp:675: Fehler: invalid use of undefined type »struct FawkesNetworkMessage«
error: src/tools/navigator_gui/navigator_gui.h:38: Fehler: forward declaration of »struct FawkesNetworkMessage«
error: src/tools/navigator_gui/navigator_gui.cpp:677: Fehler: invalid use of undefined type »struct Mutex«
error: src/tools/navigator_gui/navigator_gui.h:40: Fehler: forward declaration of »struct Mutex«
error: src/tools/navigator_gui/navigator_gui.cpp:691: Fehler: invalid use of undefined type »struct Mutex«
error: src/tools/navigator_gui/navigator_gui.h:40: Fehler: forward declaration of »struct Mutex«
error: src/tools/navigator_gui/navigator_gui.cpp:693: Fehler: invalid use of undefined type »struct FawkesNetworkMessage«
error: src/tools/navigator_gui/navigator_gui.h:38: Fehler: forward declaration of »struct FawkesNetworkMessage«
error: src/tools/navigator_gui/navigator_gui.cpp:695: Fehler: invalid use of undefined type »struct FawkesNetworkMessage«
error: src/tools/navigator_gui/navigator_gui.h:38: Fehler: forward declaration of »struct FawkesNetworkMessage«
error: src/tools/navigator_gui/navigator_gui.cpp:696: Fehler: invalid use of undefined type »struct Mutex«
error: src/tools/navigator_gui/navigator_gui.h:40: Fehler: forward declaration of »struct Mutex«
error: src/tools/navigator_gui/navigator_gui.cpp:699: Fehler: invalid use of undefined type »struct Mutex«
error: src/tools/navigator_gui/navigator_gui.h:40: Fehler: forward declaration of »struct Mutex«
error: src/tools/navigator_gui/navigator_gui.cpp: In member function »void NavigatorGUI::prepare_navigator_contact()«:
error: src/tools/navigator_gui/navigator_gui.cpp:719: Fehler: invalid use of undefined type »struct FawkesNetworkMessage«
error: src/tools/navigator_gui/navigator_gui.h:38: Fehler: forward declaration of »struct FawkesNetworkMessage«
error: src/tools/navigator_gui/navigator_gui.cpp:720: Fehler: invalid use of undefined type »struct FawkesNetworkClient«
error: src/tools/navigator_gui/navigator_gui.h:37: Fehler: forward declaration of »struct FawkesNetworkClient«
error: src/tools/navigator_gui/navigator_gui.cpp:721: Fehler: invalid use of undefined type »struct FawkesNetworkMessage«
error: src/tools/navigator_gui/navigator_gui.h:38: Fehler: forward declaration of »struct FawkesNetworkMessage«
error: src/tools/navigator_gui/navigator_gui.cpp: In member function »void NavigatorGUI::process_pluginmanager_message(FawkesNetworkMessage*)«:
error: src/tools/navigator_gui/navigator_gui.cpp:730: Fehler: invalid use of undefined type »struct FawkesNetworkMessage«
error: src/tools/navigator_gui/navigator_gui.h:38: Fehler: forward declaration of »struct FawkesNetworkMessage«
error: src/tools/navigator_gui/navigator_gui.cpp:730: Fehler: »MSG_PLUGIN_UNLOADED« wurde in diesem Gültigkeitsbereich nicht definiert
error: src/tools/navigator_gui/navigator_gui.cpp:733: Fehler: »plugin_unloaded_msg_t« wurde in diesem Gültigkeitsbereich nicht definiert
error: src/tools/navigator_gui/navigator_gui.cpp:733: Fehler: »u« wurde in diesem Gültigkeitsbereich nicht definiert
error: src/tools/navigator_gui/navigator_gui.cpp:733: Fehler: expected primary-expression before »)« token
error: src/tools/navigator_gui/navigator_gui.cpp:733: Fehler: expected `;' before »msg«
error: src/tools/navigator_gui/navigator_gui.cpp:742: Fehler: invalid use of undefined type »struct FawkesNetworkMessage«
error: src/tools/navigator_gui/navigator_gui.h:38: Fehler: forward declaration of »struct FawkesNetworkMessage«
error: src/tools/navigator_gui/navigator_gui.cpp:742: Fehler: »MSG_PLUGIN_LOADED« wurde in diesem Gültigkeitsbereich nicht definiert
error: src/tools/navigator_gui/navigator_gui.cpp:745: Fehler: »plugin_loaded_msg_t« wurde in diesem Gültigkeitsbereich nicht definiert
error: src/tools/navigator_gui/navigator_gui.cpp:745: Fehler: »lm« wurde in diesem Gültigkeitsbereich nicht definiert
error: src/tools/navigator_gui/navigator_gui.cpp:745: Fehler: expected primary-expression before »)« token
error: src/tools/navigator_gui/navigator_gui.cpp:745: Fehler: expected `;' before »msg«
error: src/tools/navigator_gui/navigator_gui.cpp:751: Fehler: invalid use of undefined type »struct FawkesNetworkMessage«
error: src/tools/navigator_gui/navigator_gui.h:38: Fehler: forward declaration of »struct FawkesNetworkMessage«
error: src/tools/navigator_gui/navigator_gui.cpp:751: Fehler: »MSG_PLUGIN_LOADED_LIST« wurde in diesem Gültigkeitsbereich nicht definiert
error: src/tools/navigator_gui/navigator_gui.cpp:754: Fehler: »PluginListMessage« wurde in diesem Gültigkeitsbereich nicht definiert
error: src/tools/navigator_gui/navigator_gui.cpp:754: Fehler: »plm« wurde in diesem Gültigkeitsbereich nicht definiert
error: src/tools/navigator_gui/navigator_gui.cpp:754: Fehler: invalid use of undefined type »struct FawkesNetworkMessage«
error: src/tools/navigator_gui/navigator_gui.h:38: Fehler: forward declaration of »struct FawkesNetworkMessage«
error: src/tools/navigator_gui/navigator_gui.cpp:754: Fehler: expected primary-expression before »)« token
error: src/tools/navigator_gui/navigator_gui.cpp:772: Fehler: Argument vom Typ »&lt;type error&gt;« wurde an »delete« übergeben, Zeiger erwartet
error: src/tools/navigator_gui/navigator_gui.cpp: In member function »bool NavigatorGUI::on_idle()«:
error: src/tools/navigator_gui/navigator_gui.cpp:915: Fehler: invalid use of undefined type »struct FawkesNetworkClient«
error: src/tools/navigator_gui/navigator_gui.h:37: Fehler: forward declaration of »struct FawkesNetworkClient«
error: src/tools/navigator_gui/navigator_gui.cpp:916: Fehler: invalid use of undefined type »struct FawkesNetworkClient«
error: src/tools/navigator_gui/navigator_gui.h:37: Fehler: forward declaration of »struct FawkesNetworkClient«
error: src/tools/navigator_gui/navigator_gui.cpp:917: Fehler: invalid use of undefined type »struct FawkesNetworkClient«
error: src/tools/navigator_gui/navigator_gui.h:37: Fehler: forward declaration of »struct FawkesNetworkClient«
error: src/tools/navigator_gui/navigator_gui.cpp:918: Warnung: mögliches Problem bei Aufruf des »delete«-Operators erkannt
error: src/tools/navigator_gui/navigator_gui.cpp:918: Warnung: invalid use of undefined type »struct FawkesNetworkClient«
error: src/tools/navigator_gui/navigator_gui.h:37: Warnung: forward declaration of »struct FawkesNetworkClient«
error: src/tools/navigator_gui/navigator_gui.cpp:918: Anmerkung: weder der Destruktor noch der klassenspezifische Operator »delete« wird aufgerufen, auch wenn sie bei der Klassendefinition deklariert werden
error: src/tools/navigator_gui/navigator_gui.cpp: In member function »void NavigatorGUI::on_send_button_clicked()«:
error: src/tools/navigator_gui/navigator_gui.cpp:967: Fehler: invalid use of undefined type »struct FawkesNetworkMessage«
error: src/tools/navigator_gui/navigator_gui.h:38: Fehler: forward declaration of »struct FawkesNetworkMessage«
error: src/tools/navigator_gui/navigator_gui.cpp:968: Fehler: invalid use of undefined type »struct FawkesNetworkClient«
error: src/tools/navigator_gui/navigator_gui.h:37: Fehler: forward declaration of »struct FawkesNetworkClient«
error: src/tools/navigator_gui/navigator_gui.cpp:969: Fehler: invalid use of undefined type »struct FawkesNetworkMessage«
error: src/tools/navigator_gui/navigator_gui.h:38: Fehler: forward declaration of »struct FawkesNetworkMessage«
error: src/tools/navigator_gui/navigator_gui.cpp:978: Fehler: invalid use of undefined type »struct FawkesNetworkMessage«
error: src/tools/navigator_gui/navigator_gui.h:38: Fehler: forward declaration of »struct FawkesNetworkMessage«
error: src/tools/navigator_gui/navigator_gui.cpp:979: Fehler: invalid use of undefined type »struct FawkesNetworkClient«
error: src/tools/navigator_gui/navigator_gui.h:37: Fehler: forward declaration of »struct FawkesNetworkClient«
error: src/tools/navigator_gui/navigator_gui.cpp:980: Fehler: invalid use of undefined type »struct FawkesNetworkMessage«
error: src/tools/navigator_gui/navigator_gui.h:38: Fehler: forward declaration of »struct FawkesNetworkMessage«
error: src/tools/navigator_gui/navigator_gui.cpp:988: Fehler: invalid use of undefined type »struct FawkesNetworkMessage«
error: src/tools/navigator_gui/navigator_gui.h:38: Fehler: forward declaration of »struct FawkesNetworkMessage«
error: src/tools/navigator_gui/navigator_gui.cpp:989: Fehler: invalid use of undefined type »struct FawkesNetworkClient«
error: src/tools/navigator_gui/navigator_gui.h:37: Fehler: forward declaration of »struct FawkesNetworkClient«
error: src/tools/navigator_gui/navigator_gui.cpp:990: Fehler: invalid use of undefined type »struct FawkesNetworkMessage«
error: src/tools/navigator_gui/navigator_gui.h:38: Fehler: forward declaration of »struct FawkesNetworkMessage«
error: src/tools/navigator_gui/navigator_gui.cpp:997: Fehler: invalid use of undefined type »struct FawkesNetworkMessage«
error: src/tools/navigator_gui/navigator_gui.h:38: Fehler: forward declaration of »struct FawkesNetworkMessage«
error: src/tools/navigator_gui/navigator_gui.cpp:998: Fehler: invalid use of undefined type »struct FawkesNetworkClient«
error: src/tools/navigator_gui/navigator_gui.h:37: Fehler: forward declaration of »struct FawkesNetworkClient«
error: src/tools/navigator_gui/navigator_gui.cpp:999: Fehler: invalid use of undefined type »struct FawkesNetworkMessage«
error: src/tools/navigator_gui/navigator_gui.h:38: Fehler: forward declaration of »struct FawkesNetworkMessage«
error: src/tools/navigator_gui/navigator_gui.cpp:1007: Fehler: invalid use of undefined type »struct FawkesNetworkMessage«
error: src/tools/navigator_gui/navigator_gui.h:38: Fehler: forward declaration of »struct FawkesNetworkMessage«
error: src/tools/navigator_gui/navigator_gui.cpp:1008: Fehler: invalid use of undefined type »struct FawkesNetworkClient«
error: src/tools/navigator_gui/navigator_gui.h:37: Fehler: forward declaration of »struct FawkesNetworkClient«
error: src/tools/navigator_gui/navigator_gui.cpp:1009: Fehler: invalid use of undefined type »struct FawkesNetworkMessage«
error: src/tools/navigator_gui/navigator_gui.h:38: Fehler: forward declaration of »struct FawkesNetworkMessage«
error: src/tools/navigator_gui/navigator_gui.cpp:1018: Fehler: invalid use of undefined type »struct FawkesNetworkMessage«
error: src/tools/navigator_gui/navigator_gui.h:38: Fehler: forward declaration of »struct FawkesNetworkMessage«
error: src/tools/navigator_gui/navigator_gui.cpp:1019: Fehler: invalid use of undefined type »struct FawkesNetworkClient«
error: src/tools/navigator_gui/navigator_gui.h:37: Fehler: forward declaration of »struct FawkesNetworkClient«
error: src/tools/navigator_gui/navigator_gui.cpp:1020: Fehler: invalid use of undefined type »struct FawkesNetworkMessage«
error: src/tools/navigator_gui/navigator_gui.h:38: Fehler: forward declaration of »struct FawkesNetworkMessage«
error: src/tools/navigator_gui/navigator_gui.cpp: In member function »void NavigatorGUI::on_reset_odometry_button_clicked()«:
error: src/tools/navigator_gui/navigator_gui.cpp:1030: Fehler: invalid use of undefined type »struct FawkesNetworkMessage«
error: src/tools/navigator_gui/navigator_gui.h:38: Fehler: forward declaration of »struct FawkesNetworkMessage«
error: src/tools/navigator_gui/navigator_gui.cpp:1031: Fehler: invalid use of undefined type »struct FawkesNetworkClient«
error: src/tools/navigator_gui/navigator_gui.h:37: Fehler: forward declaration of »struct FawkesNetworkClient«
error: src/tools/navigator_gui/navigator_gui.cpp:1032: Fehler: invalid use of undefined type »struct FawkesNetworkMessage«
error: src/tools/navigator_gui/navigator_gui.h:38: Fehler: forward declaration of »struct FawkesNetworkMessage«
error: src/tools/navigator_gui/navigator_gui.cpp: In member function »void NavigatorGUI::on_navigator_control_radio_clicked()«:
error: src/tools/navigator_gui/navigator_gui.cpp:1044: Fehler: invalid use of undefined type »struct FawkesNetworkMessage«
error: src/tools/navigator_gui/navigator_gui.h:38: Fehler: forward declaration of »struct FawkesNetworkMessage«
error: src/tools/navigator_gui/navigator_gui.cpp:1045: Fehler: invalid use of undefined type »struct FawkesNetworkClient«
error: src/tools/navigator_gui/navigator_gui.h:37: Fehler: forward declaration of »struct FawkesNetworkClient«
error: src/tools/navigator_gui/navigator_gui.cpp:1046: Fehler: invalid use of undefined type »struct FawkesNetworkMessage«
error: src/tools/navigator_gui/navigator_gui.h:38: Fehler: forward declaration of »struct FawkesNetworkMessage«
error: src/tools/navigator_gui/navigator_gui.cpp:1052: Fehler: invalid use of undefined type »struct FawkesNetworkMessage«
error: src/tools/navigator_gui/navigator_gui.h:38: Fehler: forward declaration of »struct FawkesNetworkMessage«
error: src/tools/navigator_gui/navigator_gui.cpp:1053: Fehler: invalid use of undefined type »struct FawkesNetworkClient«
error: src/tools/navigator_gui/navigator_gui.h:37: Fehler: forward declaration of »struct FawkesNetworkClient«
error: src/tools/navigator_gui/navigator_gui.cpp:1054: Fehler: invalid use of undefined type »struct FawkesNetworkMessage«
error: src/tools/navigator_gui/navigator_gui.h:38: Fehler: forward declaration of »struct FawkesNetworkMessage«
error: src/tools/navigator_gui/navigator_gui.cpp:1058: Fehler: invalid use of undefined type »struct Mutex«
error: src/tools/navigator_gui/navigator_gui.h:40: Fehler: forward declaration of »struct Mutex«
error: src/tools/navigator_gui/navigator_gui.cpp:1061: Fehler: invalid use of undefined type »struct Mutex«
error: src/tools/navigator_gui/navigator_gui.h:40: Fehler: forward declaration of »struct Mutex«
error: src/tools/navigator_gui/navigator_gui.cpp: In member function »void NavigatorGUI::on_motor_control_radio_clicked()«:
error: src/tools/navigator_gui/navigator_gui.cpp:1075: Fehler: invalid use of undefined type »struct FawkesNetworkMessage«
error: src/tools/navigator_gui/navigator_gui.h:38: Fehler: forward declaration of »struct FawkesNetworkMessage«
error: src/tools/navigator_gui/navigator_gui.cpp:1076: Fehler: invalid use of undefined type »struct FawkesNetworkClient«
error: src/tools/navigator_gui/navigator_gui.h:37: Fehler: forward declaration of »struct FawkesNetworkClient«
error: src/tools/navigator_gui/navigator_gui.cpp:1077: Fehler: invalid use of undefined type »struct FawkesNetworkMessage«
error: src/tools/navigator_gui/navigator_gui.h:38: Fehler: forward declaration of »struct FawkesNetworkMessage«
error: src/tools/navigator_gui/navigator_gui.cpp:1083: Fehler: invalid use of undefined type »struct FawkesNetworkMessage«
error: src/tools/navigator_gui/navigator_gui.h:38: Fehler: forward declaration of »struct FawkesNetworkMessage«
error: src/tools/navigator_gui/navigator_gui.cpp:1084: Fehler: invalid use of undefined type »struct FawkesNetworkClient«
error: src/tools/navigator_gui/navigator_gui.h:37: Fehler: forward declaration of »struct FawkesNetworkClient«
error: src/tools/navigator_gui/navigator_gui.cpp:1085: Fehler: invalid use of undefined type »struct FawkesNetworkMessage«
error: src/tools/navigator_gui/navigator_gui.h:38: Fehler: forward declaration of »struct FawkesNetworkMessage«
error: src/tools/navigator_gui/navigator_gui.cpp: In member function »void NavigatorGUI::on_behold_radio_clicked()«:
error: src/tools/navigator_gui/navigator_gui.cpp:1100: Fehler: invalid use of undefined type »struct FawkesNetworkMessage«
error: src/tools/navigator_gui/navigator_gui.h:38: Fehler: forward declaration of »struct FawkesNetworkMessage«
error: src/tools/navigator_gui/navigator_gui.cpp:1101: Fehler: invalid use of undefined type »struct FawkesNetworkClient«
error: src/tools/navigator_gui/navigator_gui.h:37: Fehler: forward declaration of »struct FawkesNetworkClient«
error: src/tools/navigator_gui/navigator_gui.cpp:1102: Fehler: invalid use of undefined type »struct FawkesNetworkMessage«
error: src/tools/navigator_gui/navigator_gui.h:38: Fehler: forward declaration of »struct FawkesNetworkMessage«
error: src/tools/navigator_gui/navigator_gui.cpp:1109: Fehler: invalid use of undefined type »struct FawkesNetworkMessage«
error: src/tools/navigator_gui/navigator_gui.h:38: Fehler: forward declaration of »struct FawkesNetworkMessage«
error: src/tools/navigator_gui/navigator_gui.cpp:1110: Fehler: invalid use of undefined type »struct FawkesNetworkClient«
error: src/tools/navigator_gui/navigator_gui.h:37: Fehler: forward declaration of »struct FawkesNetworkClient«
error: src/tools/navigator_gui/navigator_gui.cpp:1111: Fehler: invalid use of undefined type »struct FawkesNetworkMessage«
error: src/tools/navigator_gui/navigator_gui.h:38: Fehler: forward declaration of »struct FawkesNetworkMessage«
error: src/tools/navigator_gui/navigator_gui.cpp: In member function »virtual bool NavigatorGUI::on_button_press_event(GdkEventButton*)«:
error: src/tools/navigator_gui/navigator_gui.cpp:1137: Fehler: invalid use of undefined type »struct FawkesNetworkMessage«
error: src/tools/navigator_gui/navigator_gui.h:38: Fehler: forward declaration of »struct FawkesNetworkMessage«
error: src/tools/navigator_gui/navigator_gui.cpp:1138: Fehler: invalid use of undefined type »struct FawkesNetworkClient«
error: src/tools/navigator_gui/navigator_gui.h:37: Fehler: forward declaration of »struct FawkesNetworkClient«
error: src/tools/navigator_gui/navigator_gui.cpp:1139: Fehler: invalid use of undefined type »struct FawkesNetworkMessage«
error: src/tools/navigator_gui/navigator_gui.h:38: Fehler: forward declaration of »struct FawkesNetworkMessage«
error: src/tools/navigator_gui/navigator_gui.cpp:1147: Fehler: invalid use of undefined type »struct Mutex«
error: src/tools/navigator_gui/navigator_gui.h:40: Fehler: forward declaration of »struct Mutex«
error: src/tools/navigator_gui/navigator_gui.cpp:1150: Fehler: invalid use of undefined type »struct Mutex«
error: src/tools/navigator_gui/navigator_gui.h:40: Fehler: forward declaration of »struct Mutex«
error: src/tools/navigator_gui/navigator_gui.cpp:1169: Fehler: invalid use of undefined type »struct Mutex«
error: src/tools/navigator_gui/navigator_gui.h:40: Fehler: forward declaration of »struct Mutex«
error: src/tools/navigator_gui/navigator_gui.cpp:1172: Fehler: invalid use of undefined type »struct Mutex«
error: src/tools/navigator_gui/navigator_gui.h:40: Fehler: forward declaration of »struct Mutex«
error: src/tools/navigator_gui/navigator_gui.cpp: In member function »virtual bool NavigatorGUI::on_motion_notify_event(GdkEventMotion*)«:
error: src/tools/navigator_gui/navigator_gui.cpp:1212: Fehler: invalid use of undefined type »struct Mutex«
error: src/tools/navigator_gui/navigator_gui.h:40: Fehler: forward declaration of »struct Mutex«
error: src/tools/navigator_gui/navigator_gui.cpp:1215: Fehler: invalid use of undefined type »struct Mutex«
error: src/tools/navigator_gui/navigator_gui.h:40: Fehler: forward declaration of »struct Mutex«
error: src/tools/navigator_gui/navigator_gui.cpp: In member function »virtual bool NavigatorGUI::on_enter_notify_event(GdkEventCrossing*)«:
error: src/tools/navigator_gui/navigator_gui.cpp:1235: Fehler: invalid use of undefined type »struct Mutex«
error: src/tools/navigator_gui/navigator_gui.h:40: Fehler: forward declaration of »struct Mutex«
error: src/tools/navigator_gui/navigator_gui.cpp:1238: Fehler: invalid use of undefined type »struct Mutex«
error: src/tools/navigator_gui/navigator_gui.h:40: Fehler: forward declaration of »struct Mutex«
error: src/tools/navigator_gui/navigator_gui.cpp: In member function »void NavigatorGUI::send_stop()«:
error: src/tools/navigator_gui/navigator_gui.cpp:1259: Fehler: invalid use of undefined type »struct FawkesNetworkMessage«
error: src/tools/navigator_gui/navigator_gui.h:38: Fehler: forward declaration of »struct FawkesNetworkMessage«
error: src/tools/navigator_gui/navigator_gui.cpp:1261: Fehler: invalid use of undefined type »struct FawkesNetworkClient«
error: src/tools/navigator_gui/navigator_gui.h:37: Fehler: forward declaration of »struct FawkesNetworkClient«
error: src/tools/navigator_gui/navigator_gui.cpp:1262: Fehler: invalid use of undefined type »struct FawkesNetworkMessage«
error: src/tools/navigator_gui/navigator_gui.h:38: Fehler: forward declaration of »struct FawkesNetworkMessage«
error: src/tools/navigator_gui/navigator_gui.cpp:1271: Fehler: invalid use of undefined type »struct FawkesNetworkMessage«
error: src/tools/navigator_gui/navigator_gui.h:38: Fehler: forward declaration of »struct FawkesNetworkMessage«
error: src/tools/navigator_gui/navigator_gui.cpp:1272: Fehler: invalid use of undefined type »struct FawkesNetworkClient«
error: src/tools/navigator_gui/navigator_gui.h:37: Fehler: forward declaration of »struct FawkesNetworkClient«
error: src/tools/navigator_gui/navigator_gui.cpp:1273: Fehler: invalid use of undefined type »struct FawkesNetworkMessage«
error: src/tools/navigator_gui/navigator_gui.h:38: Fehler: forward declaration of »struct FawkesNetworkMessage«
error: src/tools/navigator_gui/navigator_gui.cpp: In member function »void NavigatorGUI::send_drive_command()«:
error: src/tools/navigator_gui/navigator_gui.cpp:1283: Fehler: invalid use of undefined type »struct FawkesNetworkMessage«
error: src/tools/navigator_gui/navigator_gui.h:38: Fehler: forward declaration of »struct FawkesNetworkMessage«
error: src/tools/navigator_gui/navigator_gui.cpp:1284: Fehler: invalid use of undefined type »struct FawkesNetworkClient«
error: src/tools/navigator_gui/navigator_gui.h:37: Fehler: forward declaration of »struct FawkesNetworkClient«
error: src/tools/navigator_gui/navigator_gui.cpp:1285: Fehler: invalid use of undefined type »struct FawkesNetworkMessage«
error: src/tools/navigator_gui/navigator_gui.h:38: Fehler: forward declaration of »struct FawkesNetworkMessage«
error: src/tools/navigator_gui/navigator_gui.cpp:1292: Fehler: invalid use of undefined type »struct FawkesNetworkMessage«
error: src/tools/navigator_gui/navigator_gui.h:38: Fehler: forward declaration of »struct FawkesNetworkMessage«
error: src/tools/navigator_gui/navigator_gui.cpp:1293: Fehler: invalid use of undefined type »struct FawkesNetworkClient«
error: src/tools/navigator_gui/navigator_gui.h:37: Fehler: forward declaration of »struct FawkesNetworkClient«
error: src/tools/navigator_gui/navigator_gui.cpp:1294: Fehler: invalid use of undefined type »struct FawkesNetworkMessage«
error: src/tools/navigator_gui/navigator_gui.h:38: Fehler: forward declaration of »struct FawkesNetworkMessage«
error: src/tools/navigator_gui/navigator_gui.cpp: In member function »virtual bool NavigatorGUI::on_expose_event(GdkEventExpose*)«:
error: src/tools/navigator_gui/navigator_gui.cpp:1356: Fehler: »lines« wurde in diesem Gültigkeitsbereich nicht definiert
error: src/tools/navigator_gui/navigator_gui.cpp:1357: Fehler: »LockList« wurde in diesem Gültigkeitsbereich nicht definiert
error: src/tools/navigator_gui/navigator_gui.cpp:1357: Fehler: expected primary-expression before »*« token
error: src/tools/navigator_gui/navigator_gui.cpp:1357: Fehler: expected primary-expression before »&gt;« token
error: src/tools/navigator_gui/navigator_gui.cpp:1357: Fehler: »::iterator« wurde nicht deklariert
error: src/tools/navigator_gui/navigator_gui.cpp:1357: Fehler: expected `;' before »iterator«
error: src/tools/navigator_gui/navigator_gui.cpp:1358: Fehler: »iterator« wurde in diesem Gültigkeitsbereich nicht definiert
error: src/tools/navigator_gui/navigator_gui.cpp:1367: Fehler: »obstacles« wurde in diesem Gültigkeitsbereich nicht definiert
error: src/tools/navigator_gui/navigator_gui.cpp:1368: Fehler: expected primary-expression before »*« token
error: src/tools/navigator_gui/navigator_gui.cpp:1368: Fehler: expected primary-expression before »&gt;« token
error: src/tools/navigator_gui/navigator_gui.cpp:1368: Fehler: »::iterator« wurde nicht deklariert
error: src/tools/navigator_gui/navigator_gui.cpp:1368: Fehler: expected `;' before »iterator«
error: src/tools/navigator_gui/navigator_gui.cpp:1369: Fehler: »iterator« wurde in diesem Gültigkeitsbereich nicht definiert
error: src/tools/navigator_gui/navigator_gui.cpp:1385: Fehler: »path_points« wurde in diesem Gültigkeitsbereich nicht definiert
error: src/tools/navigator_gui/navigator_gui.cpp:1391: Fehler: expected primary-expression before »*« token
error: src/tools/navigator_gui/navigator_gui.cpp:1391: Fehler: expected primary-expression before »&gt;« token
error: src/tools/navigator_gui/navigator_gui.cpp:1391: Fehler: »::iterator« wurde nicht deklariert
error: src/tools/navigator_gui/navigator_gui.cpp:1391: Fehler: expected `;' before »iterator«
error: src/tools/navigator_gui/navigator_gui.cpp:1392: Fehler: »iterator« wurde in diesem Gültigkeitsbereich nicht definiert
error: src/tools/navigator_gui/navigator_gui.cpp:1545: Fehler: invalid use of undefined type »struct Mutex«
error: src/tools/navigator_gui/navigator_gui.h:40: Fehler: forward declaration of »struct Mutex«
error: src/tools/navigator_gui/navigator_gui.cpp:1547: Fehler: invalid use of undefined type »struct Mutex«
error: src/tools/navigator_gui/navigator_gui.h:40: Fehler: forward declaration of »struct Mutex«
error: src/tools/navigator_gui/navigator_gui.cpp:1562: Fehler: invalid use of undefined type »struct Mutex«
error: src/tools/navigator_gui/navigator_gui.h:40: Fehler: forward declaration of »struct Mutex«
error: src/tools/navigator_gui/navigator_gui.cpp:1564: Fehler: invalid use of undefined type »struct Mutex«
error: src/tools/navigator_gui/navigator_gui.h:40: Fehler: forward declaration of »struct Mutex«
error: src/tools/navigator_gui/navigator_gui.cpp:1571: Fehler: invalid use of undefined type »struct Mutex«
error: src/tools/navigator_gui/navigator_gui.h:40: Fehler: forward declaration of »struct Mutex«
error: src/tools/navigator_gui/navigator_gui.cpp:1580: Fehler: invalid use of undefined type »struct Mutex«
error: src/tools/navigator_gui/navigator_gui.h:40: Fehler: forward declaration of »struct Mutex«
error: src/tools/navigator_gui/navigator_gui.cpp:1582: Fehler: invalid use of undefined type »struct Mutex«
error: src/tools/navigator_gui/navigator_gui.h:40: Fehler: forward declaration of »struct Mutex«
error: src/tools/navigator_gui/navigator_gui.cpp:1601: Fehler: invalid use of undefined type »struct Mutex«
error: src/tools/navigator_gui/navigator_gui.h:40: Fehler: forward declaration of »struct Mutex«
error: src/tools/navigator_gui/navigator_gui.cpp:1608: Fehler: expected primary-expression before »*« token
error: src/tools/navigator_gui/navigator_gui.cpp:1608: Fehler: expected primary-expression before »&gt;« token
error: src/tools/navigator_gui/navigator_gui.cpp:1608: Fehler: »::iterator« wurde nicht deklariert
error: src/tools/navigator_gui/navigator_gui.cpp:1608: Fehler: expected `;' before »iterator«
error: src/tools/navigator_gui/navigator_gui.cpp:1609: Fehler: »iterator« wurde in diesem Gültigkeitsbereich nicht definiert
error: src/tools/navigator_gui/navigator_gui.cpp:1720: Fehler: invalid use of undefined type »struct Mutex«
error: src/tools/navigator_gui/navigator_gui.h:40: Fehler: forward declaration of »struct Mutex«
error: src/tools/navigator_gui/navigator_gui.cpp:1729: Fehler: invalid use of undefined type »struct Mutex«
error: src/tools/navigator_gui/navigator_gui.h:40: Fehler: forward declaration of »struct Mutex«
error: src/tools/navigator_gui/navigator_gui.cpp:1736: Fehler: expected primary-expression before »*« token
error: src/tools/navigator_gui/navigator_gui.cpp:1736: Fehler: expected primary-expression before »&gt;« token
error: src/tools/navigator_gui/navigator_gui.cpp:1736: Fehler: »::iterator« wurde nicht deklariert
error: src/tools/navigator_gui/navigator_gui.cpp:1736: Fehler: expected `;' before »iterator«
error: src/tools/navigator_gui/navigator_gui.cpp: In function »int main(int, char**)«:
error: src/tools/navigator_gui/navigator_gui.cpp:1764: Fehler: »ArgumentParser« wurde in diesem Gültigkeitsbereich nicht definiert
error: src/tools/navigator_gui/navigator_gui.cpp:1764: Fehler: »argp« wurde in diesem Gültigkeitsbereich nicht definiert
error: src/tools/navigator_gui/navigator_gui.cpp:1764: Fehler: expected type-specifier before »ArgumentParser«
error: src/tools/navigator_gui/navigator_gui.cpp:1764: Fehler: expected `;' before »ArgumentParser«
error: make[4]: *** [navigator_gui.o] Fehler 1
error: make[3]: *** [.objs] Fehler 2
error: make[2]: *** [navigator_gui] Fehler 2
error: make[1]: *** [tools] Fehler 2
error: make: *** [src] Fehler 2


More information about the fawkes-trac mailing list